Записиnpmglob7.2.3
Изменить условия
Текущие условия
glob @7.2.3windows 11 · x64 · node 24 · npm 11 · node
итог по пакету, а не API
0 из 68 прошли
Проверено — эта сеть выполнила контракт в этой координате.
образец есть — наш запуск в этой координате не прошёл (1)
- Наблюдения в проектах
- 152 / 232
- Проверки контрактом
- 0 / 68
- Записи об использовании
- 331
- Независимые сообщившие пиры
- 1
- Сбои с собранным отпечатком
- 78 / 80
- Последняя запись
- 2026-09-16
Здоровье зависимостей
Наблюдаемые комбинации и свидетельства сбоев для этого выпуска
Первый обнаруженный сбой
7.2.3
windows · node@24.13 · executionContext=node · moduleSystem=esm
32 FAIL
· stage: UNKNOWN
· fingerprint: sha256:9f91c975308128a0f4f23e33b9d5936b9c39535b5c01aa9245b8cdc4b0a37a10
| Библиотека | Версия | Состояние | Измерено там | Проектов |
|---|---|---|---|---|
| minimatch | 3.1.2 | CANDIDATE Коррелированное изменение; комбинация не подтверждена | контракт пройден | 3 проектных дня |
| minimatch | 3.1.5 | CANDIDATE Коррелированное изменение; комбинация не подтверждена | контракт пройден | 70 проектных дней |
| fs.realpath | 1.0.0 | PASS Все наблюдения прошли успешно | контракт пройден | 66 проектных дней |
| inflight | 1.0.6 | PASS Все наблюдения прошли успешно | контракт пройден | 64 проектных дня |
| inherits | 2.0.4 | PASS Все наблюдения прошли успешно | контракт пройден | 68 проектных дней |
| once | 1.4.0 | PASS Все наблюдения прошли успешно | контракт пройден | 68 проектных дней |
| path-is-absolute | 1.0.1 | PASS Все наблюдения прошли успешно | контракт пройден | 63 проектных дня |
Столбец измерения относится к релизу самой зависимости, а не к паре. То, что резолвер поставил два релиза рядом, не доказывает, что они работают вместе.
Версии зависимостей по выпускам
К чему каждый выпуск этого пакета разрешил своих потомков. Потомок, чья версия сдвинулась, идёт первым: там обновление изменило что-то под вами.
| Библиотека | 13.0.6 | 13.0.0 | 10.5.0 | 10.3.10 | 8.1.0 | 7.2.3 |
|---|---|---|---|---|---|---|
| jackspeak | — | — | 3.4.3 | 2.3.6 | — | — |
| minimatch | 10.2.5 | 10.1.1 | 9.0.5 | 9.0.5 | 5.1.9 | 3.1.2 |
| minipass | 7.1.3 | 7.1.2 | 7.1.2 | 7.1.2 | — | — |
| path-scurry | 2.0.2 | 2.0.1 | 1.11.1 | 1.11.1 | — | — |
| foreground-child | — | — | 3.3.1 | 3.3.1 | — | — |
| fs.realpath | — | — | — | — | 1.0.0 | 1.0.0 |
| inflight | — | — | — | — | 1.0.6 | 1.0.6 |
| inherits | — | — | — | — | 2.0.4 | 2.0.4 |
| once | — | — | — | — | 1.4.0 | 1.4.0 |
| package-json-from-dist | — | — | 1.0.1 | — | — | — |
| path-is-absolute | — | — | — | — | — | 1.0.1 |
Сдвинулось: 4 · одинаково во всех выпусках: 7
Ребро фиксирует, что резолвер поставил один релиз рядом с другим на реальной машине. Это не утверждение, что они работают вместе; на этот вопрос отвечают образцы и контракты, а не наличие строки.
Недавние кластеры сбоев
-
наблюдалось UNKNOWN exit 1 ERR_PNPM_RECURSIVE_RUN_FIRST_FAIL Пробел в данных ×32 7.2.3 executionContext=node · moduleSystem=esm · os=windows · runtime=node@24.13 sha256:9f91c9753081…(node:<n>) ExperimentalWarning: SQLite is an experimental feature and might change at any time …pnpm · unclassified-diagnostic · outer pnpm · gap stage-unknownКачество данных: complete · Варианты среды: 1 · Первая запись: 2026-09-01 · Последнее наблюдение: 2026-09-17Кандидат на диагностическую перепроверку
-
наблюдалось UNKNOWN exit 1 ERR_PNPM_RECURSIVE_EXEC_FIRST_FAIL Пробел в данных ×28 7.2.3 executionContext=node · moduleSystem=esm · os=windows · runtime=node@24.13 sha256:979755e6489d…(node:<n>) ExperimentalWarning: SQLite is an experimental feature and might change at any time …pnpm · unclassified-diagnostic · outer pnpm · gap stage-unknownКачество данных: complete · Варианты среды: 1 · Первая запись: 2026-09-01 · Последнее наблюдение: 2026-09-15Кандидат на диагностическую перепроверку
-
наблюдалось PROJECT_COMPILE exit 2 TS2307 ×12 7.2.3 → 10.3.10 → 10.5.0 executionContext=node · moduleSystem=cjs · os=windows · runtime=node@24.13 sha256:0470f88d95bb…lib/hooks/queries/index.ts(<n>,<n>): error TS2307: Cannot find module <str> or its corresponding type declarations. …typescript/tsc · compiler-diagnosticКачество данных: complete · Варианты среды: 1 · Первая запись: 2026-09-01 · Последнее наблюдение: 2026-09-01
-
наблюдалось PROJECT_COMPILE exit 2 TS7006 ×12 7.2.3 → 10.3.10 → 10.5.0 executionContext=node · moduleSystem=cjs · os=windows · runtime=node@24.13 sha256:21025cd78572…app/api/politicians/[id]/real-estates/route.ts(<n>,<n>): error TS7006: Parameter <str> implicitly has an <str> type. …typescript/tsc · compiler-diagnosticКачество данных: complete · Варианты среды: 1 · Первая запись: 2026-09-01 · Последнее наблюдение: 2026-09-01
-
наблюдалось PROJECT_COMPILE exit 2 TS2561 ×12 7.2.3 → 10.3.10 → 10.5.0 executionContext=node · moduleSystem=cjs · os=windows · runtime=node@24.13 sha256:5f96e966539e…app/api/politicians/[id]/real-estates/route.ts(<n>,<n>): error TS2561: Object literal may only specify known properties, but <str> does not exist in type …typescript/tsc · compiler-diagnosticКачество данных: complete · Варианты среды: 1 · Первая запись: 2026-09-01 · Последнее наблюдение: 2026-09-01
-
наблюдалось PROJECT_COMPILE exit 2 TS2345 ×12 7.2.3 → 10.3.10 → 10.5.0 executionContext=node · moduleSystem=cjs · os=windows · runtime=node@24.13 sha256:7e077f646acc…lib/api/real-estate-statistics.ts(<n>,<n>): error TS2345: Argument of type <str> is not assignable to parameter of type <str>.typescript/tsc · compiler-diagnosticКачество данных: complete · Варианты среды: 1 · Первая запись: 2026-09-01 · Последнее наблюдение: 2026-09-01
-
наблюдалось PROJECT_COMPILE exit 2 TS2551 ×12 7.2.3 → 10.3.10 → 10.5.0 executionContext=node · moduleSystem=cjs · os=windows · runtime=node@24.13 sha256:8a1ebc675f2b…app/api/politicians/[id]/real-estates/route.ts(<n>,<n>): error TS2551: Property <str> does not exist on type <str>. Did you mean <str>? …typescript/tsc · compiler-diagnosticКачество данных: complete · Варианты среды: 1 · Первая запись: 2026-09-01 · Последнее наблюдение: 2026-09-01
-
наблюдалось PROJECT_COMPILE exit 2 TS2339 ×12 7.2.3 → 10.3.10 → 10.5.0 executionContext=node · moduleSystem=cjs · os=windows · runtime=node@24.13 sha256:e51205820175…lib/api/real-estate-map-addresses.ts(<n>,<n>): error TS2339: Property <str> does not exist on type <str>.typescript/tsc · compiler-diagnosticКачество данных: complete · Варианты среды: 1 · Первая запись: 2026-09-01 · Последнее наблюдение: 2026-09-01
-
наблюдалось PROJECT_COMPILE exit 2 TS2305 ×12 7.2.3 → 10.3.10 → 10.5.0 executionContext=node · moduleSystem=cjs · os=windows · runtime=node@24.13 sha256:e7aa54217e13…app/api/politicians/[id]/real-estates/route.ts(<n>,<n>): error TS2305: Module <str> has no exported member <str>. …typescript/tsc · compiler-diagnosticКачество данных: complete · Варианты среды: 1 · Первая запись: 2026-09-01 · Последнее наблюдение: 2026-09-01
-
наблюдалось UNKNOWN exit 1 ERR_PNPM_RECURSIVE_EXEC_FIRST_FAIL Пробел в данных ×11 7.2.3 executionContext=node · moduleSystem=esm · os=windows · runtime=node@24.13 sha256:73873d2c4aed…<str> is not recognized as an internal or external command, · operable program or batch file. · undefined …pnpm · unclassified-diagnostic · outer pnpm · gap stage-unknownКачество данных: complete · Варианты среды: 1 · Первая запись: 2026-09-01 · Последнее наблюдение: 2026-09-01Кандидат на диагностическую перепроверку
-
наблюдалось PROJECT_TEST exit 1 ELIFECYCLE ×10 7.2.3 executionContext=node · moduleSystem=esm · os=windows · runtime=node@24.13 sha256:7711694d48fa…ELIFECYCLE Test failed. See above for more details.javascript/test-runner · test-runner-diagnostic · outer pnpm testКачество данных: complete · Варианты среды: 1 · Первая запись: 2026-08-29 · Последнее наблюдение: 2026-09-01
-
наблюдалось PROCESS_START process start failed Пробел в данных ×10 7.2.3 → 8.1.0 executionContext=node sha256:c12549970456…· structured-termination · gap diagnostic-missingКачество данных: partial · Варианты среды: 2 · Первая запись: 2026-08-31 · Последнее наблюдение: 2026-09-16Кандидат на диагностическую перепроверку
Показаны 12 наиболее часто сообщаемых из 309 записанных кластеров отказов. Остальные — единичные сообщения.