Registrosnpmget-intrinsic1.3.0
Mudar as condições
Condições atuais
get-intrinsic @1.3.0debian glibc · x64 · node 22 · npm · node
total do pacote, não uma API
Registrado como presente em projetos. Nada foi executado nesta coordenada.
Observado — builds reais de projetos reportaram desta coordenada.
há uma amostra aqui e ainda não a executamos nesta coordenada (1)
- Observações de projetos
- nada nesta coordenada
- Verificações de contrato
- nada nesta coordenada
- Registros de uso
- 8
- Peers independentes que reportaram
- 1
- Último registro
- 2026-09-14
Saúde das dependências
Combinações observadas e evidências de falha para esta versão
Primeira quebra observada
1.3.0
windows · node@24.13 · moduleSystem=esm · executionContext=node
31 FAIL
· stage: UNKNOWN
· fingerprint: sha256:9f91c975308128a0f4f23e33b9d5936b9c39535b5c01aa9245b8cdc4b0a37a10
| Biblioteca | Versão | Saúde | Medido ali | Projetos |
|---|---|---|---|---|
| call-bind-apply-helpers | 1.0.2 | PASS Todas as observações passaram | contrato aprovado | 76 dias-projeto |
| es-define-property | 1.0.1 | PASS Todas as observações passaram | contrato aprovado | 72 dias-projeto |
| es-errors | 1.3.0 | PASS Todas as observações passaram | contrato aprovado | 81 dias-projeto |
| es-object-atoms | 1.1.1 | PASS Todas as observações passaram | contrato aprovado | 3 dias-projeto |
| es-object-atoms | 1.1.2 | PASS Todas as observações passaram | contrato aprovado | 74 dias-projeto |
| function-bind | 1.1.2 | PASS Todas as observações passaram | contrato aprovado | 76 dias-projeto |
| get-proto | 1.0.1 | PASS Todas as observações passaram | contrato aprovado | 65 dias-projeto |
| gopd | 1.2.0 | PASS Todas as observações passaram | contrato aprovado | 68 dias-projeto |
| has-symbols | 1.1.0 | PASS Todas as observações passaram | contrato aprovado | 65 dias-projeto |
| hasown | 2.0.2 | PASS Todas as observações passaram | contrato aprovado | 3 dias-projeto |
| hasown | 2.0.4 | PASS Todas as observações passaram | contrato aprovado | 72 dias-projeto |
| math-intrinsics | 1.1.0 | PASS Todas as observações passaram | contrato aprovado | 64 dias-projeto |
A coluna de medição é sobre a versão de cada dependência em si, não sobre o par. Um resolvedor ter colocado duas versões lado a lado não é prova de que funcionam juntas.
Clusters de falha recentes
-
observado PROJECT_PROCESS ERR_MODULE_NOT_FOUND Lacuna de evidência ×20 1.3.0 executionContext=nodeQualidade da evidência: legacy-evidence-incomplete · Variantes de ambiente: 2 · Primeiro registro: 2026-08-13 · Visto por último: 2026-08-21Candidato a reverificação diagnóstica
-
observado UNKNOWN exit 1 ERR_ASSERTION Lacuna de evidência ×2 1.3.0 executionContext=node · moduleSystem=esm · os=linux · runtime=node@22.23 sha256:986d98189e70…node:internal/modules/run_main:<n> · triggerUncaughtException( · ^ · AssertionError [ERR_ASSERTION]: Expected values to be strictly equal:node · unclassified-diagnostic · outer node · gap stage-unknownQualidade da evidência: complete · Variantes de ambiente: 1 · Primeiro registro: 2026-08-31 · Visto por último: 2026-08-31Candidato a reverificação diagnóstica
-
observado UNKNOWN exit 1 Lacuna de evidência ×1 1.3.0 executionContext=node · moduleSystem=esm · os=linux · runtime=node@22.23 sha256:795cbb5ee086…Error: Cannot find module <str> · Require stack: · - <path> · - <path>node · unclassified-diagnostic · outer node · gap stage-unknownQualidade da evidência: complete · Variantes de ambiente: 1 · Primeiro registro: 2026-08-30 · Visto por último: 2026-08-30Candidato a reverificação diagnóstica
-
observado UNKNOWN exit 1 Lacuna de evidência ×1 1.3.0 executionContext=node · moduleSystem=cjs · os=linux · runtime=node@22.23 sha256:0c06875294a4…Contract test failed: TypeError: Cannot read properties of undefined (reading <str>) · at runContract (<url>) …node · unclassified-diagnostic · outer node · gap stage-unknownQualidade da evidência: complete · Variantes de ambiente: 1 · Primeiro registro: 2026-08-30 · Visto por último: 2026-08-30Candidato a reverificação diagnóstica
-
observado UNKNOWN exit 1 ERR_ASSERTION Lacuna de evidência ×1 1.3.0 executionContext=node · moduleSystem=cjs · os=linux · runtime=node@22.23 sha256:0d62cac8c07a…AssertionError [ERR_ASSERTION]: Expected values to be strictly equal: · + actual - expected · + <str> · - <str>node · unclassified-diagnostic · outer node · gap stage-unknownQualidade da evidência: complete · Variantes de ambiente: 1 · Primeiro registro: 2026-08-30 · Visto por último: 2026-08-30Candidato a reverificação diagnóstica
-
observado UNKNOWN exit 1 Lacuna de evidência ×1 1.3.0 executionContext=node · moduleSystem=cjs · os=linux · runtime=node@22.23 sha256:9630b514e713…Contract test failed: TypeError: this.terminate is not a function · at ProgressBar.set currentAmount [as currentAmount] <path>:<n>:<n>) …node · unclassified-diagnostic · outer node · gap stage-unknownQualidade da evidência: complete · Variantes de ambiente: 1 · Primeiro registro: 2026-08-30 · Visto por último: 2026-08-30Candidato a reverificação diagnóstica
-
observado UNKNOWN exit 1 ERR_ASSERTION Lacuna de evidência ×1 1.3.0 executionContext=node · moduleSystem=cjs · os=linux · runtime=node@22.23 sha256:9ed50b51742b…Contract test failed: AssertionError [ERR_ASSERTION]: Expected values to be strictly equal: · 0 !== 50 · at runContract (<url>) …node · unclassified-diagnostic · outer node · gap stage-unknownQualidade da evidência: complete · Variantes de ambiente: 1 · Primeiro registro: 2026-08-30 · Visto por último: 2026-08-30Candidato a reverificação diagnóstica
-
observado UNKNOWN exit 1 Lacuna de evidência ×1 1.3.0 executionContext=node · moduleSystem=cjs · os=linux · runtime=node@22.23 sha256:a592ca8c2930…Contract test failed: TypeError: this.stream.moveCursor is not a function · at MultiProgress.allocateLines <path>:<n>:<n>) …node · unclassified-diagnostic · outer node · gap stage-unknownQualidade da evidência: complete · Variantes de ambiente: 1 · Primeiro registro: 2026-08-30 · Visto por último: 2026-08-30Candidato a reverificação diagnóstica
-
observado UNKNOWN exit 1 Lacuna de evidência ×1 1.3.0 executionContext=node · moduleSystem=cjs · os=linux · runtime=node@22.23 sha256:e1d65fc7c136…<path>:<n> · throw new Error(`Unsupported arch ${name}`) · ^ · Error: Unsupported arch 1node · unclassified-diagnostic · outer node · gap stage-unknownQualidade da evidência: complete · Variantes de ambiente: 1 · Primeiro registro: 2026-08-30 · Visto por último: 2026-08-30Candidato a reverificação diagnóstica
-
observado UNKNOWN exit 1 ERR_ASSERTION Lacuna de evidência ×1 1.3.0 executionContext=node · moduleSystem=esm · os=linux · runtime=node@22.23 sha256:c38a78d344c3…Contract verification failed: AssertionError [ERR_ASSERTION]: Expected values to be strictly equal: · + actual - expected · + [Function: createRoot$1] …node · unclassified-diagnostic · outer node · gap stage-unknownQualidade da evidência: complete · Variantes de ambiente: 1 · Primeiro registro: 2026-08-30 · Visto por último: 2026-08-30Candidato a reverificação diagnóstica
-
observado UNKNOWN exit 1 ERR_ASSERTION Lacuna de evidência ×1 1.3.0 executionContext=node · moduleSystem=esm · os=linux · runtime=node@22.23 sha256:10e769edac62…node:internal/modules/run_main:<n> · triggerUncaughtException( · ^ · AssertionError [ERR_ASSERTION]: The expression evaluated to a falsy value:node · unclassified-diagnostic · outer node · gap stage-unknownQualidade da evidência: complete · Variantes de ambiente: 1 · Primeiro registro: 2026-08-31 · Visto por último: 2026-08-31Candidato a reverificação diagnóstica
-
observado UNKNOWN exit 1 Lacuna de evidência ×1 1.3.0 executionContext=node · moduleSystem=cjs · os=linux · runtime=node@22.23 sha256:91ad26545eb1…node:internal/modules/cjs/loader:<n> · throw err; · ^ · Error: Cannot find module <str>node · unclassified-diagnostic · outer node · gap stage-unknownQualidade da evidência: complete · Variantes de ambiente: 1 · Primeiro registro: 2026-08-31 · Visto por último: 2026-08-31Candidato a reverificação diagnóstica
Mostrando os 12 mais relatados de 16 grupos de falhas registrados. O resto são relatos únicos.