Записиnpmfs-extra10.1.0fs-extra.writeFile
Изменить условия
Текущие условия
fs-extra.writeFile @10.1.0ubuntu glibc · x64 · node 22 · npm 10 · node
0 из 9 прошли
Проверено — эта сеть выполнила контракт в этой координате.
образец есть — наш запуск в этой координате не прошёл
- Наблюдения в проектах
- 8 / 8
- Проверки контрактом
- 0 / 9
- Независимые сообщившие пиры
- 2
- Последняя запись
- 2026-08-31
Здоровье зависимостей
Наблюдаемые комбинации и свидетельства сбоев для этого выпуска
Первый обнаруженный сбой
10.1.0
windows · node@24.13 · moduleSystem=esm · executionContext=node
192 FAIL
· stage: UNKNOWN
· fingerprint: sha256:9f91c975308128a0f4f23e33b9d5936b9c39535b5c01aa9245b8cdc4b0a37a10
| Библиотека | Версия | Состояние | Измерено там | Проектов |
|---|---|---|---|---|
| jsonfile | 6.2.1 | CANDIDATE Коррелированное изменение; комбинация не подтверждена | контракт пройден | 68 проектных дней |
| universalify | 2.0.1 | CANDIDATE Коррелированное изменение; комбинация не подтверждена | контракт пройден | 67 проектных дней |
| graceful-fs | 4.2.11 | PASS Все наблюдения прошли успешно | контракт пройден | 69 проектных дней |
Столбец измерения относится к релизу самой зависимости, а не к паре. То, что резолвер поставил два релиза рядом, не доказывает, что они работают вместе.
Версии зависимостей по выпускам
К чему каждый выпуск этого пакета разрешил своих потомков. Потомок, чья версия сдвинулась, идёт первым: там обновление изменило что-то под вами.
| Библиотека | 11.4.0 | 11.3.1 | 11.3.0 | 10.1.0 | 9.1.0 | 8.1.0 | 7.0.1 |
|---|---|---|---|---|---|---|---|
| jsonfile | 6.2.1 | 6.2.1 | 6.2.1 | 6.2.1 | 6.2.1 | 4.0.0 | 4.0.0 |
| universalify | 2.0.1 | 2.0.1 | 2.0.1 | 2.0.1 | 2.0.1 | 0.1.2 | 0.1.2 |
| at-least-node | — | — | — | — | 1.0.0 | — | — |
| graceful-fs | 4.2.11 | 4.2.11 | 4.2.11 | 4.2.11 | 4.2.11 | 4.2.11 | 4.2.11 |
Сдвинулось: 2 · одинаково во всех выпусках: 2
Ребро фиксирует, что резолвер поставил один релиз рядом с другим на реальной машине. Это не утверждение, что они работают вместе; на этот вопрос отвечают образцы и контракты, а не наличие строки.
Недавние кластеры сбоев
-
наблюдалось UNKNOWN exit 1 Пробел в данных ×31 7.0.1 → 8.1.0 → 9.1.0 → 10.1.0 → 11.3.1 → 11.4.0 executionContext=node · moduleSystem=cjs sha256:bc4d7ddc5bcd…node:internal/modules/cjs/loader:<n> · throw err; · ^ · Error: Cannot find module <str>npm · unclassified-diagnostic · outer npm run, npm test · gap stage-unknownКачество данных: complete · Варианты среды: 2 · Первая запись: 2026-09-02 · Последнее наблюдение: 2026-09-15Кандидат на диагностическую перепроверку
-
наблюдалось UNKNOWN exit 1 Пробел в данных ×28 8.1.0 → 10.1.0 executionContext=node · moduleSystem=cjs · os=linux · runtime=node@22.23 fs-extra.writeFile sha256:9be950af9140…Traceback (most recent call last): · File <str>, line 1, in <module> · ModuleNotFoundError: No module named <str>python3 · unclassified-diagnostic · outer python3 · gap stage-unknownКачество данных: complete · Варианты среды: 1 · Первая запись: 2026-08-30 · Последнее наблюдение: 2026-08-31Кандидат на диагностическую перепроверку
-
наблюдалось PROCESS_START process start failed Пробел в данных ×21 7.0.1 → 8.1.0 → 9.1.0 → 10.1.0 → 11.3.1 → 11.4.0 executionContext=node sha256:c12549970456…· structured-termination · gap diagnostic-missingКачество данных: partial · Варианты среды: 2 · Первая запись: 2026-08-30 · Последнее наблюдение: 2026-09-16Кандидат на диагностическую перепроверку
-
наблюдалось UNKNOWN exit 1 Пробел в данных ×8 8.1.0 → 10.1.0 executionContext=node · moduleSystem=cjs · os=linux · runtime=node@22.23 sha256:72ba2d1e946f…<path>: No module named pippython3 · unclassified-diagnostic · outer python3 · gap stage-unknownКачество данных: complete · Варианты среды: 1 · Первая запись: 2026-08-31 · Последнее наблюдение: 2026-08-31Кандидат на диагностическую перепроверку
-
наблюдалось UNKNOWN exit 1 Пробел в данных ×7 8.1.0 → 10.1.0 executionContext=node · moduleSystem=cjs · os=linux · runtime=node@22.23 fs-extra.writeFile sha256:91ad26545eb1…node:internal/modules/cjs/loader:<n> · throw err; · ^ · Error: Cannot find module <str>node · unclassified-diagnostic · outer node · gap stage-unknownКачество данных: complete · Варианты среды: 1 · Первая запись: 2026-08-29 · Последнее наблюдение: 2026-08-31Кандидат на диагностическую перепроверку
-
наблюдалось UNKNOWN exit 2 Пробел в данных ×7 8.1.0 → 10.1.0 executionContext=node · moduleSystem=cjs · os=linux · runtime=node@22.23 sha256:fddf8ea09045…Using CPython 3.12.3 interpreter at: <path> · Creating virtual environment at: .venv · error: Failed to create virtual environment …· unclassified-diagnostic · gap stage-unknownКачество данных: complete · Варианты среды: 1 · Первая запись: 2026-08-30 · Последнее наблюдение: 2026-08-31Кандидат на диагностическую перепроверку
-
наблюдалось UNKNOWN exit 1 ERR_ASSERTION Пробел в данных ×6 7.0.1 → 8.1.0 → 9.1.0 → 10.1.0 → 11.3.1 → 11.4.0 executionContext=node · moduleSystem=cjs · os=linux · runtime=node@22.23 sha256:0d62cac8c07a…AssertionError [ERR_ASSERTION]: Expected values to be strictly equal: · + actual - expected · + <str> · - <str>node · unclassified-diagnostic · outer node · gap stage-unknownКачество данных: complete · Варианты среды: 1 · Первая запись: 2026-08-30 · Последнее наблюдение: 2026-08-30Кандидат на диагностическую перепроверку
-
наблюдалось UNKNOWN exit 1 Пробел в данных ×6 7.0.1 → 8.1.0 → 9.1.0 → 10.1.0 → 11.3.1 → 11.4.0 executionContext=node · moduleSystem=cjs · os=linux · runtime=node@22.23 sha256:e1d65fc7c136…<path>:<n> · throw new Error(`Unsupported arch ${name}`) · ^ · Error: Unsupported arch 1node · unclassified-diagnostic · outer node · gap stage-unknownКачество данных: complete · Варианты среды: 1 · Первая запись: 2026-08-30 · Последнее наблюдение: 2026-08-30Кандидат на диагностическую перепроверку
-
наблюдалось UNKNOWN exit 1 ERR_ASSERTION Пробел в данных ×3 10.1.0 → 11.4.0 executionContext=node · moduleSystem=cjs · os=linux · runtime=node@22.23 sha256:986d98189e70…node:internal/modules/run_main:<n> · triggerUncaughtException( · ^ · AssertionError [ERR_ASSERTION]: Expected values to be strictly equal:node · unclassified-diagnostic · outer node · gap stage-unknownКачество данных: complete · Варианты среды: 1 · Первая запись: 2026-08-29 · Последнее наблюдение: 2026-09-14Кандидат на диагностическую перепроверку
-
наблюдалось PROJECT_TEST exit 1 ERR_ASSERTION ×2 10.1.0 executionContext=node · moduleSystem=cjs · os=linux · runtime=node@22.23 sha256:45fc70285a65…Contract test failed: AssertionError [ERR_ASSERTION]: DOWNLOAD_PROGRESS event should have fired · false !== true · at main (<path>:<n>:<n>) { …javascript/test-runner · test-runner-diagnostic · outer npm testКачество данных: complete · Варианты среды: 1 · Первая запись: 2026-08-29 · Последнее наблюдение: 2026-08-29
-
наблюдалось UNKNOWN exit 1 Пробел в данных ×2 8.1.0 → 10.1.0 executionContext=node · moduleSystem=cjs · os=linux · runtime=node@22.23 sha256:13e610412b4d…<path> · <path>· unclassified-diagnostic · gap stage-unknownКачество данных: complete · Варианты среды: 1 · Первая запись: 2026-08-31 · Последнее наблюдение: 2026-08-31Кандидат на диагностическую перепроверку
-
наблюдалось UNKNOWN exit 1 Пробел в данных ×2 8.1.0 → 10.1.0 executionContext=node · moduleSystem=cjs · os=linux · runtime=node@22.23 sha256:1efba491e785…Traceback (most recent call last): · File <str>, line 153, in <module> · main() · File <str>, line 144, in mainpython3 · unclassified-diagnostic · outer python3 · gap stage-unknownКачество данных: complete · Варианты среды: 1 · Первая запись: 2026-08-31 · Последнее наблюдение: 2026-08-31Кандидат на диагностическую перепроверку
Показаны 12 наиболее часто сообщаемых из 47 записанных кластеров отказов. Остальные — единичные сообщения.