Registrosnpmfs-extra10.1.0fs-extra.writeFile
Mudar as condições
Condições atuais
fs-extra.writeFile @10.1.0ubuntu glibc · x64 · node 22 · npm 10 · node
0 de 9 passaram
Verificado — esta rede executou um contrato nesta coordenada.
há uma amostra aqui e nossa execução nesta coordenada falhou
- Observações de projetos
- 8 / 8
- Verificações de contrato
- 0 / 9
- Peers independentes que reportaram
- 2
- Último registro
- 2026-08-31
Saúde das dependências
Combinações observadas e evidências de falha para esta versão
Primeira quebra observada
10.1.0
windows · node@24.13 · moduleSystem=esm · executionContext=node
192 FAIL
· stage: UNKNOWN
· fingerprint: sha256:9f91c975308128a0f4f23e33b9d5936b9c39535b5c01aa9245b8cdc4b0a37a10
| Biblioteca | Versão | Saúde | Medido ali | Projetos |
|---|---|---|---|---|
| jsonfile | 6.2.1 | CANDIDATE Mudança correlacionada; combinação não comprovada | contrato aprovado | 68 dias-projeto |
| universalify | 2.0.1 | CANDIDATE Mudança correlacionada; combinação não comprovada | contrato aprovado | 67 dias-projeto |
| graceful-fs | 4.2.11 | PASS Todas as observações passaram | contrato aprovado | 69 dias-projeto |
A coluna de medição é sobre a versão de cada dependência em si, não sobre o par. Um resolvedor ter colocado duas versões lado a lado não é prova de que funcionam juntas.
Versões de dependências por versão
Para que cada versão deste pacote resolveu seus filhos. O filho cuja versão se moveu vem primeiro: foi ali que uma atualização mudou algo sob os seus pés.
| Biblioteca | 11.4.0 | 11.3.1 | 11.3.0 | 10.1.0 | 9.1.0 | 8.1.0 | 7.0.1 |
|---|---|---|---|---|---|---|---|
| jsonfile | 6.2.1 | 6.2.1 | 6.2.1 | 6.2.1 | 6.2.1 | 4.0.0 | 4.0.0 |
| universalify | 2.0.1 | 2.0.1 | 2.0.1 | 2.0.1 | 2.0.1 | 0.1.2 | 0.1.2 |
| at-least-node | — | — | — | — | 1.0.0 | — | — |
| graceful-fs | 4.2.11 | 4.2.11 | 4.2.11 | 4.2.11 | 4.2.11 | 4.2.11 | 4.2.11 |
Moveram-se: 2 · iguais em todas as versões: 2
Uma aresta registra que um resolvedor colocou uma versão ao lado de outra em uma máquina real. Não é uma afirmação de que as duas funcionam juntas; essa pergunta é respondida por amostras e contratos, não pela presença de uma linha.
Clusters de falha recentes
-
observado UNKNOWN exit 1 Lacuna de evidência ×31 7.0.1 → 8.1.0 → 9.1.0 → 10.1.0 → 11.3.1 → 11.4.0 executionContext=node · moduleSystem=cjs sha256:bc4d7ddc5bcd…node:internal/modules/cjs/loader:<n> · throw err; · ^ · Error: Cannot find module <str>npm · unclassified-diagnostic · outer npm run, npm test · gap stage-unknownQualidade da evidência: complete · Variantes de ambiente: 2 · Primeiro registro: 2026-09-02 · Visto por último: 2026-09-15Candidato a reverificação diagnóstica
-
observado UNKNOWN exit 1 Lacuna de evidência ×28 8.1.0 → 10.1.0 executionContext=node · moduleSystem=cjs · os=linux · runtime=node@22.23 fs-extra.writeFile sha256:9be950af9140…Traceback (most recent call last): · File <str>, line 1, in <module> · ModuleNotFoundError: No module named <str>python3 · unclassified-diagnostic · outer python3 · gap stage-unknownQualidade da evidência: complete · Variantes de ambiente: 1 · Primeiro registro: 2026-08-30 · Visto por último: 2026-08-31Candidato a reverificação diagnóstica
-
observado PROCESS_START process start failed Lacuna de evidência ×21 7.0.1 → 8.1.0 → 9.1.0 → 10.1.0 → 11.3.1 → 11.4.0 executionContext=node sha256:c12549970456…· structured-termination · gap diagnostic-missingQualidade da evidência: partial · Variantes de ambiente: 2 · Primeiro registro: 2026-08-30 · Visto por último: 2026-09-16Candidato a reverificação diagnóstica
-
observado UNKNOWN exit 1 Lacuna de evidência ×8 8.1.0 → 10.1.0 executionContext=node · moduleSystem=cjs · os=linux · runtime=node@22.23 sha256:72ba2d1e946f…<path>: No module named pippython3 · unclassified-diagnostic · outer python3 · gap stage-unknownQualidade da evidência: complete · Variantes de ambiente: 1 · Primeiro registro: 2026-08-31 · Visto por último: 2026-08-31Candidato a reverificação diagnóstica
-
observado UNKNOWN exit 1 Lacuna de evidência ×7 8.1.0 → 10.1.0 executionContext=node · moduleSystem=cjs · os=linux · runtime=node@22.23 fs-extra.writeFile sha256:91ad26545eb1…node:internal/modules/cjs/loader:<n> · throw err; · ^ · Error: Cannot find module <str>node · unclassified-diagnostic · outer node · gap stage-unknownQualidade da evidência: complete · Variantes de ambiente: 1 · Primeiro registro: 2026-08-29 · Visto por último: 2026-08-31Candidato a reverificação diagnóstica
-
observado UNKNOWN exit 2 Lacuna de evidência ×7 8.1.0 → 10.1.0 executionContext=node · moduleSystem=cjs · os=linux · runtime=node@22.23 sha256:fddf8ea09045…Using CPython 3.12.3 interpreter at: <path> · Creating virtual environment at: .venv · error: Failed to create virtual environment …· unclassified-diagnostic · gap stage-unknownQualidade da evidência: complete · Variantes de ambiente: 1 · Primeiro registro: 2026-08-30 · Visto por último: 2026-08-31Candidato a reverificação diagnóstica
-
observado UNKNOWN exit 1 ERR_ASSERTION Lacuna de evidência ×6 7.0.1 → 8.1.0 → 9.1.0 → 10.1.0 → 11.3.1 → 11.4.0 executionContext=node · moduleSystem=cjs · os=linux · runtime=node@22.23 sha256:0d62cac8c07a…AssertionError [ERR_ASSERTION]: Expected values to be strictly equal: · + actual - expected · + <str> · - <str>node · unclassified-diagnostic · outer node · gap stage-unknownQualidade da evidência: complete · Variantes de ambiente: 1 · Primeiro registro: 2026-08-30 · Visto por último: 2026-08-30Candidato a reverificação diagnóstica
-
observado UNKNOWN exit 1 Lacuna de evidência ×6 7.0.1 → 8.1.0 → 9.1.0 → 10.1.0 → 11.3.1 → 11.4.0 executionContext=node · moduleSystem=cjs · os=linux · runtime=node@22.23 sha256:e1d65fc7c136…<path>:<n> · throw new Error(`Unsupported arch ${name}`) · ^ · Error: Unsupported arch 1node · unclassified-diagnostic · outer node · gap stage-unknownQualidade da evidência: complete · Variantes de ambiente: 1 · Primeiro registro: 2026-08-30 · Visto por último: 2026-08-30Candidato a reverificação diagnóstica
-
observado UNKNOWN exit 1 ERR_ASSERTION Lacuna de evidência ×3 10.1.0 → 11.4.0 executionContext=node · moduleSystem=cjs · os=linux · runtime=node@22.23 sha256:986d98189e70…node:internal/modules/run_main:<n> · triggerUncaughtException( · ^ · AssertionError [ERR_ASSERTION]: Expected values to be strictly equal:node · unclassified-diagnostic · outer node · gap stage-unknownQualidade da evidência: complete · Variantes de ambiente: 1 · Primeiro registro: 2026-08-29 · Visto por último: 2026-09-14Candidato a reverificação diagnóstica
-
observado PROJECT_TEST exit 1 ERR_ASSERTION ×2 10.1.0 executionContext=node · moduleSystem=cjs · os=linux · runtime=node@22.23 sha256:45fc70285a65…Contract test failed: AssertionError [ERR_ASSERTION]: DOWNLOAD_PROGRESS event should have fired · false !== true · at main (<path>:<n>:<n>) { …javascript/test-runner · test-runner-diagnostic · outer npm testQualidade da evidência: complete · Variantes de ambiente: 1 · Primeiro registro: 2026-08-29 · Visto por último: 2026-08-29
-
observado UNKNOWN exit 1 Lacuna de evidência ×2 8.1.0 → 10.1.0 executionContext=node · moduleSystem=cjs · os=linux · runtime=node@22.23 sha256:13e610412b4d…<path> · <path>· unclassified-diagnostic · gap stage-unknownQualidade da evidência: complete · Variantes de ambiente: 1 · Primeiro registro: 2026-08-31 · Visto por último: 2026-08-31Candidato a reverificação diagnóstica
-
observado UNKNOWN exit 1 Lacuna de evidência ×2 8.1.0 → 10.1.0 executionContext=node · moduleSystem=cjs · os=linux · runtime=node@22.23 sha256:1efba491e785…Traceback (most recent call last): · File <str>, line 153, in <module> · main() · File <str>, line 144, in mainpython3 · unclassified-diagnostic · outer python3 · gap stage-unknownQualidade da evidência: complete · Variantes de ambiente: 1 · Primeiro registro: 2026-08-31 · Visto por último: 2026-08-31Candidato a reverificação diagnóstica
Mostrando os 12 mais relatados de 47 grupos de falhas registrados. O resto são relatos únicos.