Registrosnpmfs-extra10.1.0fs-extra.readFile
Cambiar las condiciones
Condiciones actuales
fs-extra.readFile @10.1.0ubuntu glibc · x64 · node 22 · npm 10 · node
0 de 9 pasaron
Verificado: esta red ejecutó un contrato en esta coordenada.
hay una muestra aquí y nuestra ejecución en esta coordenada falló
- Observaciones de proyectos
- 7 / 7
- Verificaciones de contrato
- 0 / 9
- Peers independientes que reportaron
- 2
- Último registro
- 2026-08-30
Salud de dependencias
Combinaciones observadas y evidencia de fallos para esta versión
Primer fallo observado
10.1.0
windows · node@24.13 · moduleSystem=esm · executionContext=node
192 FAIL
· stage: UNKNOWN
· fingerprint: sha256:9f91c975308128a0f4f23e33b9d5936b9c39535b5c01aa9245b8cdc4b0a37a10
| Biblioteca | Versión | Estado | Medido allí | Proyectos |
|---|---|---|---|---|
| jsonfile | 6.2.1 | CANDIDATE Cambio correlacionado; combinación no probada | contrato aprobado | 68 días-proyecto |
| universalify | 2.0.1 | CANDIDATE Cambio correlacionado; combinación no probada | contrato aprobado | 67 días-proyecto |
| graceful-fs | 4.2.11 | PASS Todas las observaciones pasaron | contrato aprobado | 69 días-proyecto |
La columna de medición se refiere a la versión de cada dependencia en sí, no al par. Que un resolutor haya colocado dos versiones juntas no prueba que funcionen juntas.
Versiones de dependencias por versión
A qué resolvió sus hijos cada versión de este paquete. Primero va el hijo cuya versión se movió: ahí una actualización cambió algo bajo tus pies.
| Biblioteca | 11.4.0 | 11.3.1 | 11.3.0 | 10.1.0 | 9.1.0 | 8.1.0 | 7.0.1 |
|---|---|---|---|---|---|---|---|
| jsonfile | 6.2.1 | 6.2.1 | 6.2.1 | 6.2.1 | 6.2.1 | 4.0.0 | 4.0.0 |
| universalify | 2.0.1 | 2.0.1 | 2.0.1 | 2.0.1 | 2.0.1 | 0.1.2 | 0.1.2 |
| at-least-node | — | — | — | — | 1.0.0 | — | — |
| graceful-fs | 4.2.11 | 4.2.11 | 4.2.11 | 4.2.11 | 4.2.11 | 4.2.11 | 4.2.11 |
Se movieron: 2 · iguales en todas las versiones: 2
Una arista registra que un resolutor colocó una versión junto a otra en una máquina real. No afirma que ambas funcionen juntas; a esa pregunta responden las muestras y los contratos, no la presencia de una fila.
Clústeres de fallos recientes
-
observado UNKNOWN exit 1 Brecha de evidencia ×31 7.0.1 → 8.1.0 → 9.1.0 → 10.1.0 → 11.3.1 → 11.4.0 executionContext=node · moduleSystem=cjs sha256:bc4d7ddc5bcd…node:internal/modules/cjs/loader:<n> · throw err; · ^ · Error: Cannot find module <str>npm · unclassified-diagnostic · outer npm run, npm test · gap stage-unknownCalidad de evidencia: complete · Variantes de entorno: 2 · Primer registro: 2026-09-02 · Última observación: 2026-09-15Candidato a reverificación diagnóstica
-
observado UNKNOWN exit 1 Brecha de evidencia ×28 8.1.0 → 10.1.0 executionContext=node · moduleSystem=cjs · os=linux · runtime=node@22.23 fs-extra.readFile sha256:9be950af9140…Traceback (most recent call last): · File <str>, line 1, in <module> · ModuleNotFoundError: No module named <str>python3 · unclassified-diagnostic · outer python3 · gap stage-unknownCalidad de evidencia: complete · Variantes de entorno: 1 · Primer registro: 2026-08-30 · Última observación: 2026-08-31Candidato a reverificación diagnóstica
-
observado PROCESS_START process start failed Brecha de evidencia ×21 7.0.1 → 8.1.0 → 9.1.0 → 10.1.0 → 11.3.1 → 11.4.0 executionContext=node sha256:c12549970456…· structured-termination · gap diagnostic-missingCalidad de evidencia: partial · Variantes de entorno: 2 · Primer registro: 2026-08-30 · Última observación: 2026-09-16Candidato a reverificación diagnóstica
-
observado UNKNOWN exit 1 Brecha de evidencia ×8 8.1.0 → 10.1.0 executionContext=node · moduleSystem=cjs · os=linux · runtime=node@22.23 sha256:72ba2d1e946f…<path>: No module named pippython3 · unclassified-diagnostic · outer python3 · gap stage-unknownCalidad de evidencia: complete · Variantes de entorno: 1 · Primer registro: 2026-08-31 · Última observación: 2026-08-31Candidato a reverificación diagnóstica
-
observado UNKNOWN exit 1 Brecha de evidencia ×7 8.1.0 → 10.1.0 executionContext=node · moduleSystem=cjs · os=linux · runtime=node@22.23 fs-extra.readFile sha256:91ad26545eb1…node:internal/modules/cjs/loader:<n> · throw err; · ^ · Error: Cannot find module <str>node · unclassified-diagnostic · outer node · gap stage-unknownCalidad de evidencia: complete · Variantes de entorno: 1 · Primer registro: 2026-08-29 · Última observación: 2026-08-31Candidato a reverificación diagnóstica
-
observado UNKNOWN exit 2 Brecha de evidencia ×7 8.1.0 → 10.1.0 executionContext=node · moduleSystem=cjs · os=linux · runtime=node@22.23 sha256:fddf8ea09045…Using CPython 3.12.3 interpreter at: <path> · Creating virtual environment at: .venv · error: Failed to create virtual environment …· unclassified-diagnostic · gap stage-unknownCalidad de evidencia: complete · Variantes de entorno: 1 · Primer registro: 2026-08-30 · Última observación: 2026-08-31Candidato a reverificación diagnóstica
-
observado UNKNOWN exit 1 ERR_ASSERTION Brecha de evidencia ×6 7.0.1 → 8.1.0 → 9.1.0 → 10.1.0 → 11.3.1 → 11.4.0 executionContext=node · moduleSystem=cjs · os=linux · runtime=node@22.23 sha256:0d62cac8c07a…AssertionError [ERR_ASSERTION]: Expected values to be strictly equal: · + actual - expected · + <str> · - <str>node · unclassified-diagnostic · outer node · gap stage-unknownCalidad de evidencia: complete · Variantes de entorno: 1 · Primer registro: 2026-08-30 · Última observación: 2026-08-30Candidato a reverificación diagnóstica
-
observado UNKNOWN exit 1 Brecha de evidencia ×6 7.0.1 → 8.1.0 → 9.1.0 → 10.1.0 → 11.3.1 → 11.4.0 executionContext=node · moduleSystem=cjs · os=linux · runtime=node@22.23 sha256:e1d65fc7c136…<path>:<n> · throw new Error(`Unsupported arch ${name}`) · ^ · Error: Unsupported arch 1node · unclassified-diagnostic · outer node · gap stage-unknownCalidad de evidencia: complete · Variantes de entorno: 1 · Primer registro: 2026-08-30 · Última observación: 2026-08-30Candidato a reverificación diagnóstica
-
observado UNKNOWN exit 1 ERR_ASSERTION Brecha de evidencia ×3 10.1.0 → 11.4.0 executionContext=node · moduleSystem=cjs · os=linux · runtime=node@22.23 sha256:986d98189e70…node:internal/modules/run_main:<n> · triggerUncaughtException( · ^ · AssertionError [ERR_ASSERTION]: Expected values to be strictly equal:node · unclassified-diagnostic · outer node · gap stage-unknownCalidad de evidencia: complete · Variantes de entorno: 1 · Primer registro: 2026-08-29 · Última observación: 2026-09-14Candidato a reverificación diagnóstica
-
observado PROJECT_TEST exit 1 ERR_ASSERTION ×2 10.1.0 executionContext=node · moduleSystem=cjs · os=linux · runtime=node@22.23 sha256:45fc70285a65…Contract test failed: AssertionError [ERR_ASSERTION]: DOWNLOAD_PROGRESS event should have fired · false !== true · at main (<path>:<n>:<n>) { …javascript/test-runner · test-runner-diagnostic · outer npm testCalidad de evidencia: complete · Variantes de entorno: 1 · Primer registro: 2026-08-29 · Última observación: 2026-08-29
-
observado UNKNOWN exit 1 Brecha de evidencia ×2 8.1.0 → 10.1.0 executionContext=node · moduleSystem=cjs · os=linux · runtime=node@22.23 sha256:13e610412b4d…<path> · <path>· unclassified-diagnostic · gap stage-unknownCalidad de evidencia: complete · Variantes de entorno: 1 · Primer registro: 2026-08-31 · Última observación: 2026-08-31Candidato a reverificación diagnóstica
-
observado UNKNOWN exit 1 Brecha de evidencia ×2 8.1.0 → 10.1.0 executionContext=node · moduleSystem=cjs · os=linux · runtime=node@22.23 sha256:1efba491e785…Traceback (most recent call last): · File <str>, line 153, in <module> · main() · File <str>, line 144, in mainpython3 · unclassified-diagnostic · outer python3 · gap stage-unknownCalidad de evidencia: complete · Variantes de entorno: 1 · Primer registro: 2026-08-31 · Última observación: 2026-08-31Candidato a reverificación diagnóstica
Se muestran los 12 más reportados de 47 grupos de fallos registrados. El resto son reportes únicos.