記録npmfs-extra10.1.0fs-extra.writeFile
条件を変更
現在の条件
fs-extra.writeFile @10.1.0ubuntu glibc · x64 · node 22 · npm 10 · node
9 回中 0 回が成功
検証 — このネットワークがこの座標でコントラクトを実行しました。
サンプルあり — この座標で実行し、失敗した
- プロジェクト観測
- 8 / 8
- コントラクト検証
- 0 / 9
- 独立した報告ピア
- 2
- 最終記録
- 2026-08-31
開ける証拠
依存関係のヘルス
このリリースの依存関係の組み合わせと失敗観測
観測された問題 1件 ·
変更 2件 ·
正常 1件
| ライブラリ | バージョン | ヘルス | その座標で測定されたこと | プロジェクト |
|---|---|---|---|---|
| jsonfile | 6.2.1 | CANDIDATE 相関変更; 組み合わせ未証明 | コントラクト合格 | プロジェクト日 68 件 |
| universalify | 2.0.1 | CANDIDATE 相関変更; 組み合わせ未証明 | コントラクト合格 | プロジェクト日 67 件 |
| graceful-fs | 4.2.11 | PASS すべての観測で成功 | コントラクト合格 | プロジェクト日 69 件 |
測定列は各依存関係自身のリリースに関するもので、2つのリリースの組み合わせに関するものではありません。リゾルバが2つを並べたという事実は、両者が協調して動く証拠ではありません。
リリースごとの依存バージョン
このパッケージの各リリースが子をどのバージョンに解決したかです。バージョンが動いた子が先に並びます — アップグレードが足元で何かを変えた地点です。
| ライブラリ | 11.4.0 | 11.3.1 | 11.3.0 | 10.1.0 | 9.1.0 | 8.1.0 | 7.0.1 |
|---|---|---|---|---|---|---|---|
| jsonfile | 6.2.1 | 6.2.1 | 6.2.1 | 6.2.1 | 6.2.1 | 4.0.0 | 4.0.0 |
| universalify | 2.0.1 | 2.0.1 | 2.0.1 | 2.0.1 | 2.0.1 | 0.1.2 | 0.1.2 |
| at-least-node | — | — | — | — | 1.0.0 | — | — |
| graceful-fs | 4.2.11 | 4.2.11 | 4.2.11 | 4.2.11 | 4.2.11 | 4.2.11 | 4.2.11 |
変動: 2 · 全リリースで同一: 2
エッジは、実機でリゾルバがあるリリースを別のリリースの隣に置いたという記録です。両者が一緒に動くという主張ではありません。その問いに答えるのは、ここに行があることではなくサンプルと契約です。
最近の失敗クラスター
-
観測済み UNKNOWN exit 1 証拠の欠落 ×31 7.0.1 → 8.1.0 → 9.1.0 → 10.1.0 → 11.3.1 → 11.4.0 executionContext=node · moduleSystem=cjs sha256:bc4d7ddc5bcd…node:internal/modules/cjs/loader:<n> · throw err; · ^ · Error: Cannot find module <str>npm · unclassified-diagnostic · outer npm run, npm test · gap stage-unknown証拠品質: complete · 環境バリアント: 2 · 初回記録: 2026-09-02 · 最終観測: 2026-09-15診断再検証候補
-
観測済み UNKNOWN exit 1 証拠の欠落 ×28 8.1.0 → 10.1.0 executionContext=node · moduleSystem=cjs · os=linux · runtime=node@22.23 fs-extra.writeFile sha256:9be950af9140…Traceback (most recent call last): · File <str>, line 1, in <module> · ModuleNotFoundError: No module named <str>python3 · unclassified-diagnostic · outer python3 · gap stage-unknown証拠品質: complete · 環境バリアント: 1 · 初回記録: 2026-08-30 · 最終観測: 2026-08-31診断再検証候補
-
観測済み PROCESS_START process start failed 証拠の欠落 ×21 7.0.1 → 8.1.0 → 9.1.0 → 10.1.0 → 11.3.1 → 11.4.0 executionContext=node sha256:c12549970456…· structured-termination · gap diagnostic-missing証拠品質: partial · 環境バリアント: 2 · 初回記録: 2026-08-30 · 最終観測: 2026-09-16診断再検証候補
-
観測済み UNKNOWN exit 1 証拠の欠落 ×8 8.1.0 → 10.1.0 executionContext=node · moduleSystem=cjs · os=linux · runtime=node@22.23 sha256:72ba2d1e946f…<path>: No module named pippython3 · unclassified-diagnostic · outer python3 · gap stage-unknown証拠品質: complete · 環境バリアント: 1 · 初回記録: 2026-08-31 · 最終観測: 2026-08-31診断再検証候補
-
観測済み UNKNOWN exit 1 証拠の欠落 ×7 8.1.0 → 10.1.0 executionContext=node · moduleSystem=cjs · os=linux · runtime=node@22.23 fs-extra.writeFile sha256:91ad26545eb1…node:internal/modules/cjs/loader:<n> · throw err; · ^ · Error: Cannot find module <str>node · unclassified-diagnostic · outer node · gap stage-unknown証拠品質: complete · 環境バリアント: 1 · 初回記録: 2026-08-29 · 最終観測: 2026-08-31診断再検証候補
-
観測済み UNKNOWN exit 2 証拠の欠落 ×7 8.1.0 → 10.1.0 executionContext=node · moduleSystem=cjs · os=linux · runtime=node@22.23 sha256:fddf8ea09045…Using CPython 3.12.3 interpreter at: <path> · Creating virtual environment at: .venv · error: Failed to create virtual environment …· unclassified-diagnostic · gap stage-unknown証拠品質: complete · 環境バリアント: 1 · 初回記録: 2026-08-30 · 最終観測: 2026-08-31診断再検証候補
-
観測済み UNKNOWN exit 1 ERR_ASSERTION 証拠の欠落 ×6 7.0.1 → 8.1.0 → 9.1.0 → 10.1.0 → 11.3.1 → 11.4.0 executionContext=node · moduleSystem=cjs · os=linux · runtime=node@22.23 sha256:0d62cac8c07a…AssertionError [ERR_ASSERTION]: Expected values to be strictly equal: · + actual - expected · + <str> · - <str>node · unclassified-diagnostic · outer node · gap stage-unknown証拠品質: complete · 環境バリアント: 1 · 初回記録: 2026-08-30 · 最終観測: 2026-08-30診断再検証候補
-
観測済み UNKNOWN exit 1 証拠の欠落 ×6 7.0.1 → 8.1.0 → 9.1.0 → 10.1.0 → 11.3.1 → 11.4.0 executionContext=node · moduleSystem=cjs · os=linux · runtime=node@22.23 sha256:e1d65fc7c136…<path>:<n> · throw new Error(`Unsupported arch ${name}`) · ^ · Error: Unsupported arch 1node · unclassified-diagnostic · outer node · gap stage-unknown証拠品質: complete · 環境バリアント: 1 · 初回記録: 2026-08-30 · 最終観測: 2026-08-30診断再検証候補
-
観測済み UNKNOWN exit 1 ERR_ASSERTION 証拠の欠落 ×3 10.1.0 → 11.4.0 executionContext=node · moduleSystem=cjs · os=linux · runtime=node@22.23 sha256:986d98189e70…node:internal/modules/run_main:<n> · triggerUncaughtException( · ^ · AssertionError [ERR_ASSERTION]: Expected values to be strictly equal:node · unclassified-diagnostic · outer node · gap stage-unknown証拠品質: complete · 環境バリアント: 1 · 初回記録: 2026-08-29 · 最終観測: 2026-09-14診断再検証候補
-
観測済み PROJECT_TEST exit 1 ERR_ASSERTION ×2 10.1.0 executionContext=node · moduleSystem=cjs · os=linux · runtime=node@22.23 sha256:45fc70285a65…Contract test failed: AssertionError [ERR_ASSERTION]: DOWNLOAD_PROGRESS event should have fired · false !== true · at main (<path>:<n>:<n>) { …javascript/test-runner · test-runner-diagnostic · outer npm test証拠品質: complete · 環境バリアント: 1 · 初回記録: 2026-08-29 · 最終観測: 2026-08-29
-
観測済み UNKNOWN exit 1 証拠の欠落 ×2 8.1.0 → 10.1.0 executionContext=node · moduleSystem=cjs · os=linux · runtime=node@22.23 sha256:13e610412b4d…<path> · <path>· unclassified-diagnostic · gap stage-unknown証拠品質: complete · 環境バリアント: 1 · 初回記録: 2026-08-31 · 最終観測: 2026-08-31診断再検証候補
-
観測済み UNKNOWN exit 1 証拠の欠落 ×2 8.1.0 → 10.1.0 executionContext=node · moduleSystem=cjs · os=linux · runtime=node@22.23 sha256:1efba491e785…Traceback (most recent call last): · File <str>, line 153, in <module> · main() · File <str>, line 144, in mainpython3 · unclassified-diagnostic · outer python3 · gap stage-unknown証拠品質: complete · 環境バリアント: 1 · 初回記録: 2026-08-31 · 最終観測: 2026-08-31診断再検証候補
最も多く報告された 12 件を表示しています。この座標に記録された失敗クラスタは 47 件です。残りは単発の報告です。