Registrosnpmform-data4.0.6
Mudar as condições
Condições atuais
form-data @4.0.6debian glibc · x64 · node 22 · npm · node
total do pacote, não uma API
Registrado como presente em projetos. Nada foi executado nesta coordenada.
Observado — builds reais de projetos reportaram desta coordenada.
há uma amostra aqui e ainda não a executamos nesta coordenada (1)
- Observações de projetos
- nada nesta coordenada
- Verificações de contrato
- nada nesta coordenada
- Registros de uso
- 6
- Peers independentes que reportaram
- 1
- Último registro
- 2026-09-08
Saúde das dependências
Combinações observadas e evidências de falha para esta versão
Primeira quebra observada
4.0.6
windows · node@24.13 · moduleSystem=esm · executionContext=node
32 FAIL
· stage: UNKNOWN
· fingerprint: sha256:9f91c975308128a0f4f23e33b9d5936b9c39535b5c01aa9245b8cdc4b0a37a10
| Biblioteca | Versão | Saúde | Medido ali | Projetos |
|---|---|---|---|---|
| hasown | 2.0.4 | CANDIDATE Mudança correlacionada; combinação não comprovada | contrato aprovado | 36 dias-projeto |
| asynckit | 0.4.0 | PASS Todas as observações passaram | contrato aprovado | 37 dias-projeto |
| combined-stream | 1.0.8 | PASS Todas as observações passaram | contrato aprovado | 39 dias-projeto |
| es-set-tostringtag | 2.1.0 | PASS Todas as observações passaram | contrato aprovado | 38 dias-projeto |
| mime-types | 2.1.35 | PASS Todas as observações passaram | contrato aprovado | 35 dias-projeto |
A coluna de medição é sobre a versão de cada dependência em si, não sobre o par. Um resolvedor ter colocado duas versões lado a lado não é prova de que funcionam juntas.
Versões de dependências por versão
Para que cada versão deste pacote resolveu seus filhos. O filho cuja versão se moveu vem primeiro: foi ali que uma atualização mudou algo sob os seus pés.
| Biblioteca | 4.0.6 | 4.0.4 |
|---|---|---|
| hasown | 2.0.4 | 2.0.2 |
| asynckit | 0.4.0 | 0.4.0 |
| combined-stream | 1.0.8 | 1.0.8 |
| es-set-tostringtag | 2.1.0 | 2.1.0 |
| mime-types | 2.1.35 | 2.1.35 |
Moveram-se: 1 · iguais em todas as versões: 4
Uma aresta registra que um resolvedor colocou uma versão ao lado de outra em uma máquina real. Não é uma afirmação de que as duas funcionam juntas; essa pergunta é respondida por amostras e contratos, não pela presença de uma linha.
Clusters de falha recentes
-
observado PROJECT_PROCESS ERR_MODULE_NOT_FOUND Lacuna de evidência ×7 4.0.6 executionContext=nodeQualidade da evidência: legacy-evidence-incomplete · Variantes de ambiente: 2 · Primeiro registro: 2026-08-13 · Visto por último: 2026-08-21Candidato a reverificação diagnóstica
-
observado UNKNOWN exit 1 Lacuna de evidência ×1 4.0.6 executionContext=node · moduleSystem=esm · os=linux · runtime=node@22.23 sha256:795cbb5ee086…Error: Cannot find module <str> · Require stack: · - <path> · - <path>node · unclassified-diagnostic · outer node · gap stage-unknownQualidade da evidência: complete · Variantes de ambiente: 1 · Primeiro registro: 2026-08-30 · Visto por último: 2026-08-30Candidato a reverificação diagnóstica
-
observado UNKNOWN exit 1 ERR_ASSERTION Lacuna de evidência ×1 4.0.6 executionContext=node · moduleSystem=esm · os=linux · runtime=node@22.23 sha256:c38a78d344c3…Contract verification failed: AssertionError [ERR_ASSERTION]: Expected values to be strictly equal: · + actual - expected · + [Function: createRoot$1] …node · unclassified-diagnostic · outer node · gap stage-unknownQualidade da evidência: complete · Variantes de ambiente: 1 · Primeiro registro: 2026-08-30 · Visto por último: 2026-08-30Candidato a reverificação diagnóstica
-
observado UNKNOWN exit 1 Lacuna de evidência ×1 4.0.6 executionContext=node · moduleSystem=cjs · os=linux · runtime=node@22.23 sha256:0c06875294a4…Contract test failed: TypeError: Cannot read properties of undefined (reading <str>) · at runContract (<url>) …node · unclassified-diagnostic · outer node · gap stage-unknownQualidade da evidência: complete · Variantes de ambiente: 1 · Primeiro registro: 2026-08-30 · Visto por último: 2026-08-30Candidato a reverificação diagnóstica
-
observado UNKNOWN exit 1 ERR_ASSERTION Lacuna de evidência ×1 4.0.6 executionContext=node · moduleSystem=cjs · os=linux · runtime=node@22.23 sha256:0d62cac8c07a…AssertionError [ERR_ASSERTION]: Expected values to be strictly equal: · + actual - expected · + <str> · - <str>node · unclassified-diagnostic · outer node · gap stage-unknownQualidade da evidência: complete · Variantes de ambiente: 1 · Primeiro registro: 2026-08-30 · Visto por último: 2026-08-30Candidato a reverificação diagnóstica
-
observado UNKNOWN exit 1 Lacuna de evidência ×1 4.0.6 executionContext=node · moduleSystem=cjs · os=linux · runtime=node@22.23 sha256:9630b514e713…Contract test failed: TypeError: this.terminate is not a function · at ProgressBar.set currentAmount [as currentAmount] <path>:<n>:<n>) …node · unclassified-diagnostic · outer node · gap stage-unknownQualidade da evidência: complete · Variantes de ambiente: 1 · Primeiro registro: 2026-08-30 · Visto por último: 2026-08-30Candidato a reverificação diagnóstica
-
observado UNKNOWN exit 1 ERR_ASSERTION Lacuna de evidência ×1 4.0.6 executionContext=node · moduleSystem=cjs · os=linux · runtime=node@22.23 sha256:9ed50b51742b…Contract test failed: AssertionError [ERR_ASSERTION]: Expected values to be strictly equal: · 0 !== 50 · at runContract (<url>) …node · unclassified-diagnostic · outer node · gap stage-unknownQualidade da evidência: complete · Variantes de ambiente: 1 · Primeiro registro: 2026-08-30 · Visto por último: 2026-08-30Candidato a reverificação diagnóstica
-
observado UNKNOWN exit 1 Lacuna de evidência ×1 4.0.6 executionContext=node · moduleSystem=cjs · os=linux · runtime=node@22.23 sha256:a592ca8c2930…Contract test failed: TypeError: this.stream.moveCursor is not a function · at MultiProgress.allocateLines <path>:<n>:<n>) …node · unclassified-diagnostic · outer node · gap stage-unknownQualidade da evidência: complete · Variantes de ambiente: 1 · Primeiro registro: 2026-08-30 · Visto por último: 2026-08-30Candidato a reverificação diagnóstica
-
observado UNKNOWN exit 1 Lacuna de evidência ×1 4.0.6 executionContext=node · moduleSystem=cjs · os=linux · runtime=node@22.23 sha256:e1d65fc7c136…<path>:<n> · throw new Error(`Unsupported arch ${name}`) · ^ · Error: Unsupported arch 1node · unclassified-diagnostic · outer node · gap stage-unknownQualidade da evidência: complete · Variantes de ambiente: 1 · Primeiro registro: 2026-08-30 · Visto por último: 2026-08-30Candidato a reverificação diagnóstica
-
observado UNKNOWN exit 1 ERR_ASSERTION Lacuna de evidência ×1 4.0.6 executionContext=node · moduleSystem=esm · os=linux · runtime=node@22.23 sha256:986d98189e70…node:internal/modules/run_main:<n> · triggerUncaughtException( · ^ · AssertionError [ERR_ASSERTION]: Expected values to be strictly equal:node · unclassified-diagnostic · outer node · gap stage-unknownQualidade da evidência: complete · Variantes de ambiente: 1 · Primeiro registro: 2026-08-31 · Visto por último: 2026-08-31Candidato a reverificação diagnóstica
-
observado UNKNOWN exit 1 Lacuna de evidência ×1 4.0.6 executionContext=node · moduleSystem=esm · os=linux · runtime=node@22.23 sha256:529aac3b1da7…<url> · globalThis.navigator = dom.window.navigator; · ^ · TypeError: Cannot set property navigator of #<Object> which has only a getternode · unclassified-diagnostic · outer node · gap stage-unknownQualidade da evidência: complete · Variantes de ambiente: 1 · Primeiro registro: 2026-09-12 · Visto por último: 2026-09-12Candidato a reverificação diagnóstica