Registrosnpmfind-up-simple1.0.1
Mudar as condições
Condições atuais
find-up-simple @1.0.1debian glibc · x64 · node 22 · npm · node
total do pacote, não uma API
2 de 2 passaram
Verificado — esta rede executou um contrato nesta coordenada.
há uma amostra aqui e nossa execução nesta coordenada terminou limpa (2)
- Observações de projetos
- 4 / 4
- Verificações de contrato
- 2 / 2
- Registros de uso
- 2
- Peers independentes que reportaram
- 1
- Último registro
- 2026-09-17
Evidências que você pode abrir
Saúde das dependências
Uma resolução leu a árvore desta versão e não encontrou dependências. Isso é uma medição, não uma medição ausente.
Clusters de falha recentes
-
observado PROCESS_START process start failed Lacuna de evidência ×1 1.0.1 executionContext=node · moduleSystem=cjs · os=linux · runtime=node@22.23 sha256:c12549970456…· structured-termination · gap diagnostic-missingQualidade da evidência: partial · Variantes de ambiente: 1 · Primeiro registro: 2026-09-05 · Visto por último: 2026-09-05Candidato a reverificação diagnóstica
-
observado PROJECT_RESOLVE exit 1 ×1 1.0.1 executionContext=node · moduleSystem=cjs · os=linux · runtime=node@22.23 sha256:15e1b71df43a…test_contract.go:<n>:<n>: no required module provides package golang.org/x/text/unicode/norm: go.mod file not found in current directory or any parent …go/module · resolve-diagnostic · outer go runQualidade da evidência: complete · Variantes de ambiente: 1 · Primeiro registro: 2026-09-05 · Visto por último: 2026-09-05
-
observado UNKNOWN exit 1 Lacuna de evidência ×1 1.0.1 executionContext=node · moduleSystem=esm · os=linux · runtime=node@22.23 sha256:036052acb454…[eval]:<n> · const inst1 = plugin(api, { method: <str>, include: [<str>, <str>] }); · ^ · TypeError: plugin is not a functionnode · unclassified-diagnostic · outer node · gap stage-unknownQualidade da evidência: complete · Variantes de ambiente: 1 · Primeiro registro: 2026-09-05 · Visto por último: 2026-09-05Candidato a reverificação diagnóstica
-
observado UNKNOWN exit 1 Lacuna de evidência ×1 1.0.1 executionContext=node · moduleSystem=cjs · os=linux · runtime=node@22.23 sha256:138a106a5937…stat main.go: no such file or directorygo · unclassified-diagnostic · outer go run · gap stage-unknownQualidade da evidência: complete · Variantes de ambiente: 1 · Primeiro registro: 2026-09-05 · Visto por último: 2026-09-05Candidato a reverificação diagnóstica
-
observado UNKNOWN exit 1 Lacuna de evidência ×1 1.0.1 executionContext=node · moduleSystem=cjs · os=linux · runtime=node@22.23 sha256:69ab38336834…assertion 1 failed: expected text/plain; version=0.0.4; charset=utf-8, got text/plain; version=0.0.4; charset=utf-8; escaping=underscores · exit status 1go · unclassified-diagnostic · outer go run · gap stage-unknownQualidade da evidência: complete · Variantes de ambiente: 1 · Primeiro registro: 2026-09-05 · Visto por último: 2026-09-05Candidato a reverificação diagnóstica
-
observado UNKNOWN exit 1 ERR_ASSERTION Lacuna de evidência ×1 1.0.1 executionContext=node · moduleSystem=cjs · os=linux · runtime=node@22.23 sha256:761ce8fa9777…node:assert:<n> · throw new AssertionError(obj); · ^ · AssertionError [ERR_ASSERTION]: Should yield 4 tokens for const answer = 42;node · unclassified-diagnostic · outer node · gap stage-unknownQualidade da evidência: complete · Variantes de ambiente: 1 · Primeiro registro: 2026-09-05 · Visto por último: 2026-09-05Candidato a reverificação diagnóstica
-
observado UNKNOWN exit 1 ERR_MODULE_NOT_FOUND Lacuna de evidência ×1 1.0.1 executionContext=node · moduleSystem=cjs · os=linux · runtime=node@22.23 sha256:88af852f99a8…node:internal/modules/package_json_reader:<n> · throw new ERR_MODULE_NOT_FOUND(packageName, fileURLToPath(base), null); · ^ …node · unclassified-diagnostic · outer node · gap stage-unknownQualidade da evidência: complete · Variantes de ambiente: 1 · Primeiro registro: 2026-09-05 · Visto por último: 2026-09-05Candidato a reverificação diagnóstica
-
observado UNKNOWN exit 1 ERR_ASSERTION Lacuna de evidência ×1 1.0.1 executionContext=node · moduleSystem=cjs · os=linux · runtime=node@22.23 sha256:986d98189e70…node:internal/modules/run_main:<n> · triggerUncaughtException( · ^ · AssertionError [ERR_ASSERTION]: Expected values to be strictly equal:node · unclassified-diagnostic · outer node · gap stage-unknownQualidade da evidência: complete · Variantes de ambiente: 1 · Primeiro registro: 2026-09-14 · Visto por último: 2026-09-14Candidato a reverificação diagnóstica