Relevésnpmfilelist1.0.6
Changer les conditions
Conditions actuelles
filelist @1.0.6debian glibc · x64 · node 22 · npm · node
total du paquet, pas une API
Enregistré comme présent dans des projets. Rien n'a été exécuté à cette coordonnée.
Observé — de vrais builds de projets ont fait remonter cette coordonnée.
il y a un échantillon ici et nous ne l'avons pas encore exécuté à cette coordonnée (1)
- Observations de projets
- rien à cette coordonnée
- Vérifications de contrat
- rien à cette coordonnée
- Enregistrements d'usage
- 4
- Pairs rapporteurs indépendants
- 1
- Dernier enregistrement
- 2026-09-07
Santé des dépendances
Combinaisons observées et preuves d'échec pour cette version
Premier échec observé
1.0.6
windows · node@24.13 · moduleSystem=esm · executionContext=node
32 FAIL
· stage: UNKNOWN
· fingerprint: sha256:9f91c975308128a0f4f23e33b9d5936b9c39535b5c01aa9245b8cdc4b0a37a10
| Bibliothèque | Version | Santé | Mesuré là-bas | Projets |
|---|---|---|---|---|
| minimatch | 5.1.9 | PASS Toutes les observations ont réussi | contrat réussi | 27 jours-projet |
La colonne de mesure porte sur la version de chaque dépendance elle-même, pas sur la paire. Qu'un résolveur ait placé deux versions côte à côte ne prouve pas qu'elles fonctionnent ensemble.
Clusters d'échecs récents
-
observé UNKNOWN exit 1 ERR_MODULE_NOT_FOUND Lacune de preuve ×4 1.0.6 executionContext=node · moduleSystem=cjs · os=linux · runtime=node@22.23 sha256:88af852f99a8…node:internal/modules/package_json_reader:<n> · throw new ERR_MODULE_NOT_FOUND(packageName, fileURLToPath(base), null); · ^ …node · unclassified-diagnostic · outer node · gap stage-unknownQualité de preuve: complete · Variantes d’environnement: 1 · Premier relevé: 2026-08-29 · Dernière observation: 2026-08-30Candidat à une revérification diagnostique
-
observé UNKNOWN exit 1 Lacune de preuve ×4 1.0.6 executionContext=node · moduleSystem=cjs · os=linux · runtime=node@22.23 sha256:91ad26545eb1…node:internal/modules/cjs/loader:<n> · throw err; · ^ · Error: Cannot find module <str>node · unclassified-diagnostic · outer node · gap stage-unknownQualité de preuve: complete · Variantes d’environnement: 1 · Premier relevé: 2026-08-30 · Dernière observation: 2026-08-30Candidat à une revérification diagnostique
-
observé UNKNOWN exit 1 Lacune de preuve ×1 1.0.6 executionContext=node · moduleSystem=cjs · os=linux · runtime=node@22.23 sha256:8310a83be884…node:internal/modules/cjs/loader:<n> · const err = new Error(message); · ^ · Error: Cannot find module <str>node · unclassified-diagnostic · outer node · gap stage-unknownQualité de preuve: complete · Variantes d’environnement: 1 · Premier relevé: 2026-08-29 · Dernière observation: 2026-08-29Candidat à une revérification diagnostique
-
observé UNKNOWN exit 1 Lacune de preuve ×1 1.0.6 executionContext=node · moduleSystem=cjs · os=linux · runtime=node@22.23 sha256:9922ca80f240…go: <path> already existsgo · unclassified-diagnostic · outer go mod · gap stage-unknownQualité de preuve: complete · Variantes d’environnement: 1 · Premier relevé: 2026-08-29 · Dernière observation: 2026-08-29Candidat à une revérification diagnostique
-
observé UNKNOWN exit 1 Lacune de preuve ×1 1.0.6 executionContext=node · moduleSystem=esm · os=linux · runtime=node@22.23 sha256:795cbb5ee086…Error: Cannot find module <str> · Require stack: · - <path> · - <path>node · unclassified-diagnostic · outer node · gap stage-unknownQualité de preuve: complete · Variantes d’environnement: 1 · Premier relevé: 2026-08-30 · Dernière observation: 2026-08-30Candidat à une revérification diagnostique
-
observé UNKNOWN exit 1 ERR_ASSERTION Lacune de preuve ×1 1.0.6 executionContext=node · moduleSystem=cjs · os=linux · runtime=node@22.23 sha256:07e974cf28d4…Test failed: AssertionError [ERR_ASSERTION]: getFeedURL should return configured feed url · + actual - expected · + <str> · - <str>node · unclassified-diagnostic · outer node · gap stage-unknownQualité de preuve: complete · Variantes d’environnement: 1 · Premier relevé: 2026-08-30 · Dernière observation: 2026-08-30Candidat à une revérification diagnostique
-
observé UNKNOWN exit 1 Lacune de preuve ×1 1.0.6 executionContext=node · moduleSystem=cjs · os=linux · runtime=node@22.23 sha256:1c03ca490615…Traceback (most recent call last): · File <str>, line 3, in <module> · AttributeError: module <str> has no attribute <str> · IANA_VERSION: <str>python · unclassified-diagnostic · outer python · gap stage-unknownQualité de preuve: complete · Variantes d’environnement: 1 · Premier relevé: 2026-08-30 · Dernière observation: 2026-08-30Candidat à une revérification diagnostique
-
observé UNKNOWN exit 1 Lacune de preuve ×1 1.0.6 executionContext=node · moduleSystem=cjs · os=linux · runtime=node@22.23 sha256:9be950af9140…Traceback (most recent call last): · File <str>, line 1, in <module> · ModuleNotFoundError: No module named <str>python3 · unclassified-diagnostic · outer python3 · gap stage-unknownQualité de preuve: complete · Variantes d’environnement: 1 · Premier relevé: 2026-08-30 · Dernière observation: 2026-08-30Candidat à une revérification diagnostique
-
observé UNKNOWN exit 1 Lacune de preuve ×1 1.0.6 executionContext=node · moduleSystem=cjs · os=linux · runtime=node@22.23 sha256:d296ed2b3573…Traceback (most recent call last): · File <str>, line 5, in <module> · ModuleNotFoundError: No module named <str> · IANA_VERSION: <str>python · unclassified-diagnostic · outer python · gap stage-unknownQualité de preuve: complete · Variantes d’environnement: 1 · Premier relevé: 2026-08-30 · Dernière observation: 2026-08-30Candidat à une revérification diagnostique
-
observé UNKNOWN exit 1 ERR_ASSERTION Lacune de preuve ×1 1.0.6 executionContext=node · moduleSystem=cjs · os=linux · runtime=node@22.23 sha256:0d62cac8c07a…AssertionError [ERR_ASSERTION]: Expected values to be strictly equal: · + actual - expected · + <str> · - <str>node · unclassified-diagnostic · outer node · gap stage-unknownQualité de preuve: complete · Variantes d’environnement: 1 · Premier relevé: 2026-08-30 · Dernière observation: 2026-08-30Candidat à une revérification diagnostique
-
observé UNKNOWN exit 1 Lacune de preuve ×1 1.0.6 executionContext=node · moduleSystem=cjs · os=linux · runtime=node@22.23 sha256:e1d65fc7c136…<path>:<n> · throw new Error(`Unsupported arch ${name}`) · ^ · Error: Unsupported arch 1node · unclassified-diagnostic · outer node · gap stage-unknownQualité de preuve: complete · Variantes d’environnement: 1 · Premier relevé: 2026-08-30 · Dernière observation: 2026-08-30Candidat à une revérification diagnostique
-
observé UNKNOWN exit 1 Lacune de preuve ×1 1.0.6 executionContext=node · moduleSystem=cjs · os=linux · runtime=node@22.23 sha256:56dff8c5b74a…<path>:<n> · throw errObj; · ^ · Error: Timed out waiting for task: counter-task with status of unstartednode · unclassified-diagnostic · outer node · gap stage-unknownQualité de preuve: complete · Variantes d’environnement: 1 · Premier relevé: 2026-08-31 · Dernière observation: 2026-08-31Candidat à une revérification diagnostique
Affichage des 12 plus signalés parmi 15 groupes d’échecs enregistrés. Le reste sont des signalements uniques.