Aufzeichnungennpmfdir6.5.0
Bedingungen ändern
Aktuelle Bedingungen
fdir @6.5.0ubuntu glibc · x64 · node 22 · yarn 4 · node
Paketsumme, keine API
4 von 4 bestanden
Beobachtet — echte Projekt-Builds haben von dieser Koordinate berichtet.
hier gibt es ein Sample, und wir haben es an dieser Koordinate noch nicht ausgeführt (2)
- Projektbeobachtungen
- 4 / 4
- Contract-Verifikationen
- nichts an dieser Koordinate
- Unabhängig meldende Peers
- 1
- Zuletzt erfasst
- 2026-09-07
Nachweise zum Öffnen
Abhängigkeits-Zustand
Eine Auflösung hat den Baum dieses Releases gelesen und keine Abhängigkeiten gefunden. Das ist eine Messung, keine fehlende.
Aktuelle Fehler-Cluster
-
beobachtet PROCESS_START process start failed Beweislücke ×40 6.5.0 executionContext=node sha256:c12549970456…· structured-termination · gap diagnostic-missingBeweisqualität: partial · Umgebungsvarianten: 4 · Zuerst erfasst: 2026-09-08 · Zuletzt gesehen: 2026-09-16Kandidat für diagnostische Neuprüfung
-
beobachtet PROJECT_PROCESS ERR_ASSERTION Beweislücke ×8 6.5.0 executionContext=nodeBeweisqualität: legacy-evidence-incomplete · Umgebungsvarianten: 3 · Zuerst erfasst: 2026-08-14 · Zuletzt gesehen: 2026-08-30Kandidat für diagnostische Neuprüfung
-
beobachtet UNKNOWN exit 1 ERR_ASSERTION Beweislücke ×8 6.5.0 executionContext=node · os=linux · runtime=node@22.23 sha256:986d98189e70…node:internal/modules/run_main:<n> · triggerUncaughtException( · ^ · AssertionError [ERR_ASSERTION]: Expected values to be strictly equal:node · unclassified-diagnostic · outer node · gap stage-unknownBeweisqualität: complete · Umgebungsvarianten: 2 · Zuerst erfasst: 2026-08-29 · Zuletzt gesehen: 2026-09-14Kandidat für diagnostische Neuprüfung
-
beobachtet UNKNOWN exit 1 ERR_MODULE_NOT_FOUND Beweislücke ×4 6.5.0 executionContext=node · moduleSystem=cjs · os=linux · runtime=node@22.23 sha256:88af852f99a8…node:internal/modules/package_json_reader:<n> · throw new ERR_MODULE_NOT_FOUND(packageName, fileURLToPath(base), null); · ^ …node · unclassified-diagnostic · outer node · gap stage-unknownBeweisqualität: complete · Umgebungsvarianten: 1 · Zuerst erfasst: 2026-09-03 · Zuletzt gesehen: 2026-09-14Kandidat für diagnostische Neuprüfung
-
beobachtet UNKNOWN exit 1 ERR_ASSERTION Beweislücke ×2 6.5.0 executionContext=node · moduleSystem=esm · os=linux · runtime=node@22.23 sha256:10e769edac62…node:internal/modules/run_main:<n> · triggerUncaughtException( · ^ · AssertionError [ERR_ASSERTION]: The expression evaluated to a falsy value:node · unclassified-diagnostic · outer node · gap stage-unknownBeweisqualität: complete · Umgebungsvarianten: 1 · Zuerst erfasst: 2026-08-30 · Zuletzt gesehen: 2026-08-30Kandidat für diagnostische Neuprüfung
-
beobachtet UNKNOWN exit 1 ERR_ASSERTION Beweislücke ×2 6.5.0 executionContext=node · moduleSystem=cjs · os=linux · runtime=node@22.23 sha256:0ab3a7004d66…node:assert:<n> · throw new AssertionError(obj); · ^ · AssertionError [ERR_ASSERTION]: Expected values to be strictly equal:node · unclassified-diagnostic · outer node · gap stage-unknownBeweisqualität: complete · Umgebungsvarianten: 1 · Zuerst erfasst: 2026-09-05 · Zuletzt gesehen: 2026-09-05Kandidat für diagnostische Neuprüfung
-
beobachtet UNKNOWN exit 1 Beweislücke ×2 6.5.0 executionContext=node · os=linux · runtime=node@22.23 sha256:0bd98c410653…<path>:<n> · param.decorators.forEach(d => this.visit(d)); · ^ · TypeError: Cannot read properties of undefined (reading <str>)node · unclassified-diagnostic · outer node · gap stage-unknownBeweisqualität: complete · Umgebungsvarianten: 2 · Zuerst erfasst: 2026-09-05 · Zuletzt gesehen: 2026-09-05Kandidat für diagnostische Neuprüfung
-
beobachtet UNKNOWN exit 1 Beweislücke ×2 6.5.0 executionContext=node · moduleSystem=cjs · os=linux · runtime=node@22.23 sha256:91ad26545eb1…node:internal/modules/cjs/loader:<n> · throw err; · ^ · Error: Cannot find module <str>node · unclassified-diagnostic · outer node · gap stage-unknownBeweisqualität: complete · Umgebungsvarianten: 1 · Zuerst erfasst: 2026-09-06 · Zuletzt gesehen: 2026-09-06Kandidat für diagnostische Neuprüfung
-
beobachtet UNKNOWN exit 1 Beweislücke ×2 6.5.0 executionContext=node · moduleSystem=esm · os=linux · runtime=node@22.23 sha256:8fd30f2a6304…fil<path>:<n> · throw new Error(errorMsg); · ^ · Error: Vitest failed to access its internal state.node · unclassified-diagnostic · outer node · gap stage-unknownBeweisqualität: complete · Umgebungsvarianten: 1 · Zuerst erfasst: 2026-09-08 · Zuletzt gesehen: 2026-09-08Kandidat für diagnostische Neuprüfung
-
beobachtet UNKNOWN exit 1 Beweislücke ×2 6.5.0 executionContext=node · moduleSystem=esm · os=linux · runtime=node@22.23 sha256:536db39a2e08…<path>:<n> · const closeError = new Error(<str>) · ^ · Error: command failednpm · unclassified-diagnostic · outer npm test · gap stage-unknownBeweisqualität: complete · Umgebungsvarianten: 1 · Zuerst erfasst: 2026-10-18 · Zuletzt gesehen: 2026-10-18Kandidat für diagnostische Neuprüfung
-
beobachtet UNKNOWN exit 1 ERR_ASSERTION Beweislücke ×1 6.5.0 executionContext=node · moduleSystem=cjs · os=linux · runtime=node@22.23 sha256:8bad55cbf7c6…node:internal/assert/utils:<n> · throw err; · ^ · AssertionError [ERR_ASSERTION]: ScopeManager should record variable alphanode · unclassified-diagnostic · outer node · gap stage-unknownBeweisqualität: complete · Umgebungsvarianten: 1 · Zuerst erfasst: 2026-08-30 · Zuletzt gesehen: 2026-08-30Kandidat für diagnostische Neuprüfung
-
beobachtet UNKNOWN exit 1 ERR_ASSERTION Beweislücke ×1 6.5.0 executionContext=node · moduleSystem=cjs · os=linux · runtime=node@22.23 sha256:0d62cac8c07a…AssertionError [ERR_ASSERTION]: Expected values to be strictly equal: · + actual - expected · + <str> · - <str>node · unclassified-diagnostic · outer node · gap stage-unknownBeweisqualität: complete · Umgebungsvarianten: 1 · Zuerst erfasst: 2026-08-30 · Zuletzt gesehen: 2026-08-30Kandidat für diagnostische Neuprüfung
Es werden die 12 meistgemeldeten von 56 aufgezeichneten Fehlerclustern gezeigt. Der Rest sind Einzelmeldungen.