기록npmfdir6.5.0fdir.fdir
조건 변경
현재 조건
fdir.fdir @6.5.0debian glibc · x64 · node 22 · npm · node
1회 중 1회 통과
검증 — 이 네트워크가 이 좌표에서 컨트랙트를 직접 실행했습니다.
샘플 있음 — 이 좌표에서 우리가 실행했고 통과함 (2)
- 프로젝트 관측
- 1 / 1
- 컨트랙트 검증
- 1 / 1
- 독립 보고 peer
- 1
- 마지막 기록
- 2026-09-17
열어 볼 수 있는 증거
의존성 건강도
어떤 해결 과정이 이 릴리스의 트리를 읽었고 의존성이 없었습니다. 빠진 것이 아니라 측정된 것입니다.
최근 실패 클러스터
-
관측됨 PROCESS_START process start failed 증거 공백 ×40 6.5.0 executionContext=node sha256:c12549970456…· structured-termination · gap diagnostic-missing증거 품질: partial · 환경 변형: 4 · 최초 관측: 2026-09-08 · 마지막 관측: 2026-09-16진단 재검증 후보
-
관측됨 PROJECT_PROCESS ERR_ASSERTION 증거 공백 ×8 6.5.0 executionContext=node증거 품질: legacy-evidence-incomplete · 환경 변형: 3 · 최초 관측: 2026-08-14 · 마지막 관측: 2026-08-30진단 재검증 후보
-
관측됨 UNKNOWN exit 1 ERR_ASSERTION 증거 공백 ×8 6.5.0 executionContext=node · os=linux · runtime=node@22.23 sha256:986d98189e70…node:internal/modules/run_main:<n> · triggerUncaughtException( · ^ · AssertionError [ERR_ASSERTION]: Expected values to be strictly equal:node · unclassified-diagnostic · outer node · gap stage-unknown증거 품질: complete · 환경 변형: 2 · 최초 관측: 2026-08-29 · 마지막 관측: 2026-09-14진단 재검증 후보
-
관측됨 UNKNOWN exit 1 ERR_MODULE_NOT_FOUND 증거 공백 ×4 6.5.0 executionContext=node · moduleSystem=cjs · os=linux · runtime=node@22.23 sha256:88af852f99a8…node:internal/modules/package_json_reader:<n> · throw new ERR_MODULE_NOT_FOUND(packageName, fileURLToPath(base), null); · ^ …node · unclassified-diagnostic · outer node · gap stage-unknown증거 품질: complete · 환경 변형: 1 · 최초 관측: 2026-09-03 · 마지막 관측: 2026-09-14진단 재검증 후보
-
관측됨 UNKNOWN exit 1 ERR_ASSERTION 증거 공백 ×2 6.5.0 executionContext=node · moduleSystem=esm · os=linux · runtime=node@22.23 sha256:10e769edac62…node:internal/modules/run_main:<n> · triggerUncaughtException( · ^ · AssertionError [ERR_ASSERTION]: The expression evaluated to a falsy value:node · unclassified-diagnostic · outer node · gap stage-unknown증거 품질: complete · 환경 변형: 1 · 최초 관측: 2026-08-30 · 마지막 관측: 2026-08-30진단 재검증 후보
-
관측됨 UNKNOWN exit 1 ERR_ASSERTION 증거 공백 ×2 6.5.0 executionContext=node · moduleSystem=cjs · os=linux · runtime=node@22.23 sha256:0ab3a7004d66…node:assert:<n> · throw new AssertionError(obj); · ^ · AssertionError [ERR_ASSERTION]: Expected values to be strictly equal:node · unclassified-diagnostic · outer node · gap stage-unknown증거 품질: complete · 환경 변형: 1 · 최초 관측: 2026-09-05 · 마지막 관측: 2026-09-05진단 재검증 후보
-
관측됨 UNKNOWN exit 1 증거 공백 ×2 6.5.0 executionContext=node · os=linux · runtime=node@22.23 sha256:0bd98c410653…<path>:<n> · param.decorators.forEach(d => this.visit(d)); · ^ · TypeError: Cannot read properties of undefined (reading <str>)node · unclassified-diagnostic · outer node · gap stage-unknown증거 품질: complete · 환경 변형: 2 · 최초 관측: 2026-09-05 · 마지막 관측: 2026-09-05진단 재검증 후보
-
관측됨 UNKNOWN exit 1 증거 공백 ×2 6.5.0 executionContext=node · moduleSystem=cjs · os=linux · runtime=node@22.23 sha256:91ad26545eb1…node:internal/modules/cjs/loader:<n> · throw err; · ^ · Error: Cannot find module <str>node · unclassified-diagnostic · outer node · gap stage-unknown증거 품질: complete · 환경 변형: 1 · 최초 관측: 2026-09-06 · 마지막 관측: 2026-09-06진단 재검증 후보
-
관측됨 UNKNOWN exit 1 증거 공백 ×2 6.5.0 executionContext=node · moduleSystem=esm · os=linux · runtime=node@22.23 sha256:8fd30f2a6304…fil<path>:<n> · throw new Error(errorMsg); · ^ · Error: Vitest failed to access its internal state.node · unclassified-diagnostic · outer node · gap stage-unknown증거 품질: complete · 환경 변형: 1 · 최초 관측: 2026-09-08 · 마지막 관측: 2026-09-08진단 재검증 후보
-
관측됨 UNKNOWN exit 1 ERR_ASSERTION 증거 공백 ×1 6.5.0 executionContext=node · moduleSystem=cjs · os=linux · runtime=node@22.23 sha256:8bad55cbf7c6…node:internal/assert/utils:<n> · throw err; · ^ · AssertionError [ERR_ASSERTION]: ScopeManager should record variable alphanode · unclassified-diagnostic · outer node · gap stage-unknown증거 품질: complete · 환경 변형: 1 · 최초 관측: 2026-08-30 · 마지막 관측: 2026-08-30진단 재검증 후보
-
관측됨 UNKNOWN exit 1 ERR_ASSERTION 증거 공백 ×1 6.5.0 executionContext=node · moduleSystem=cjs · os=linux · runtime=node@22.23 sha256:0d62cac8c07a…AssertionError [ERR_ASSERTION]: Expected values to be strictly equal: · + actual - expected · + <str> · - <str>node · unclassified-diagnostic · outer node · gap stage-unknown증거 품질: complete · 환경 변형: 1 · 최초 관측: 2026-08-30 · 마지막 관측: 2026-08-30진단 재검증 후보
-
관측됨 UNKNOWN exit 1 증거 공백 ×1 6.5.0 executionContext=node · moduleSystem=cjs · os=linux · runtime=node@22.23 sha256:e1d65fc7c136…<path>:<n> · throw new Error(`Unsupported arch ${name}`) · ^ · Error: Unsupported arch 1node · unclassified-diagnostic · outer node · gap stage-unknown증거 품질: complete · 환경 변형: 1 · 최초 관측: 2026-08-30 · 마지막 관측: 2026-08-30진단 재검증 후보
가장 많이 보고된 12개를 보여줍니다. 이 좌표에 기록된 실패 클러스터는 54개입니다. 나머지는 단발 보고입니다.