记录npmestree-walker3.0.3
更改条件
依赖健康度
此版本的依赖组合与失败观测
观测到问题 1 项 ·
正常 2 项
| 库 | 版本 | 健康状态 | 在那里测得 | 项目 |
|---|---|---|---|---|
| @types/estree | 1.0.8 | PASS 所有观测均通过 | 契约通过 | 3 个项目日 |
| @types/estree | 1.0.9 | PASS 所有观测均通过 | 契约通过 | 61 个项目日 |
测量列说的是每个依赖自身版本的情况,而不是这一对的情况。解析器把两个版本放在一起,并不证明它们能协同工作。
近期失败聚类
-
已观测 UNKNOWN exit 1 ERR_PNPM_RECURSIVE_RUN_FIRST_FAIL 证据缺口 ×32 3.0.3 executionContext=node · moduleSystem=esm · os=windows · runtime=node@24.13 sha256:9f91c9753081…(node:<n>) ExperimentalWarning: SQLite is an experimental feature and might change at any time …pnpm · unclassified-diagnostic · outer pnpm · gap stage-unknown证据质量: complete · 环境变体: 1 · 首次记录: 2026-09-01 · 最近观测: 2026-09-17诊断复验候选
-
已观测 UNKNOWN exit 1 ERR_PNPM_RECURSIVE_EXEC_FIRST_FAIL 证据缺口 ×28 3.0.3 executionContext=node · moduleSystem=esm · os=windows · runtime=node@24.13 sha256:979755e6489d…(node:<n>) ExperimentalWarning: SQLite is an experimental feature and might change at any time …pnpm · unclassified-diagnostic · outer pnpm · gap stage-unknown证据质量: complete · 环境变体: 1 · 首次记录: 2026-09-01 · 最近观测: 2026-09-15诊断复验候选
-
已观测 PROCESS_START process start failed 证据缺口 ×14 3.0.3 executionContext=node sha256:c12549970456…· structured-termination · gap diagnostic-missing证据质量: partial · 环境变体: 3 · 首次记录: 2026-08-31 · 最近观测: 2026-09-16诊断复验候选
-
已观测 PROJECT_PROCESS ERR_ASSERTION 证据缺口 ×12 2.0.2 → 3.0.3 executionContext=node证据质量: legacy-evidence-incomplete · 环境变体: 3 · 首次记录: 2026-08-14 · 最近观测: 2026-08-30诊断复验候选
-
已观测 UNKNOWN exit 1 ERR_PNPM_RECURSIVE_EXEC_FIRST_FAIL 证据缺口 ×11 3.0.3 executionContext=node · moduleSystem=esm · os=windows · runtime=node@24.13 sha256:73873d2c4aed…<str> is not recognized as an internal or external command, · operable program or batch file. · undefined …pnpm · unclassified-diagnostic · outer pnpm · gap stage-unknown证据质量: complete · 环境变体: 1 · 首次记录: 2026-09-01 · 最近观测: 2026-09-01诊断复验候选
-
已观测 PROJECT_TEST exit 1 ELIFECYCLE ×10 3.0.3 executionContext=node · moduleSystem=esm · os=windows · runtime=node@24.13 sha256:7711694d48fa…ELIFECYCLE Test failed. See above for more details.javascript/test-runner · test-runner-diagnostic · outer pnpm test证据质量: complete · 环境变体: 1 · 首次记录: 2026-08-29 · 最近观测: 2026-09-01
-
已观测 PROJECT_COMPILE exit 2 TS2307 ×8 2.0.2 → 3.0.3 executionContext=node · moduleSystem=cjs · os=windows · runtime=node@24.13 sha256:0470f88d95bb…lib/hooks/queries/index.ts(<n>,<n>): error TS2307: Cannot find module <str> or its corresponding type declarations. …typescript/tsc · compiler-diagnostic证据质量: complete · 环境变体: 1 · 首次记录: 2026-09-01 · 最近观测: 2026-09-01
-
已观测 PROJECT_COMPILE exit 2 TS7006 ×8 2.0.2 → 3.0.3 executionContext=node · moduleSystem=cjs · os=windows · runtime=node@24.13 sha256:21025cd78572…app/api/politicians/[id]/real-estates/route.ts(<n>,<n>): error TS7006: Parameter <str> implicitly has an <str> type. …typescript/tsc · compiler-diagnostic证据质量: complete · 环境变体: 1 · 首次记录: 2026-09-01 · 最近观测: 2026-09-01
-
已观测 PROJECT_COMPILE exit 2 TS2561 ×8 2.0.2 → 3.0.3 executionContext=node · moduleSystem=cjs · os=windows · runtime=node@24.13 sha256:5f96e966539e…app/api/politicians/[id]/real-estates/route.ts(<n>,<n>): error TS2561: Object literal may only specify known properties, but <str> does not exist in type …typescript/tsc · compiler-diagnostic证据质量: complete · 环境变体: 1 · 首次记录: 2026-09-01 · 最近观测: 2026-09-01
-
已观测 PROJECT_COMPILE exit 2 TS2345 ×8 2.0.2 → 3.0.3 executionContext=node · moduleSystem=cjs · os=windows · runtime=node@24.13 sha256:7e077f646acc…lib/api/real-estate-statistics.ts(<n>,<n>): error TS2345: Argument of type <str> is not assignable to parameter of type <str>.typescript/tsc · compiler-diagnostic证据质量: complete · 环境变体: 1 · 首次记录: 2026-09-01 · 最近观测: 2026-09-01
-
已观测 PROJECT_COMPILE exit 2 TS2551 ×8 2.0.2 → 3.0.3 executionContext=node · moduleSystem=cjs · os=windows · runtime=node@24.13 sha256:8a1ebc675f2b…app/api/politicians/[id]/real-estates/route.ts(<n>,<n>): error TS2551: Property <str> does not exist on type <str>. Did you mean <str>? …typescript/tsc · compiler-diagnostic证据质量: complete · 环境变体: 1 · 首次记录: 2026-09-01 · 最近观测: 2026-09-01
-
已观测 PROJECT_COMPILE exit 2 TS2339 ×8 2.0.2 → 3.0.3 executionContext=node · moduleSystem=cjs · os=windows · runtime=node@24.13 sha256:e51205820175…lib/api/real-estate-map-addresses.ts(<n>,<n>): error TS2339: Property <str> does not exist on type <str>.typescript/tsc · compiler-diagnostic证据质量: complete · 环境变体: 1 · 首次记录: 2026-09-01 · 最近观测: 2026-09-01
显示报告最多的 12 个。此坐标记录的失败聚类共 274 个。其余为单次报告。