Recordsnpmestraverse5.3.0
Change the conditions
Current conditions
estraverse @5.3.0windows 11 · x64 · node 24 · pnpm 10 · node
package-level total, not an API
0 of 229 passed
Verified — this network ran a contract at this coordinate.
there is a sample here, and our run of it at this coordinate failed (7)
- Project observations
- 294 / 390
- Contract verifications
- 0 / 229
- Usage records
- 1,254
- Independent reporting peers
- 1
- Failures with a captured fingerprint
- 95 / 96
- Last recorded
- 2026-09-26
Evidence you can open
Dependency Health
A resolution read this release's tree and found no dependencies. That is a measurement, not a missing one.
Recent failure clusters
-
observed UNKNOWN exit 1 ERR_PNPM_RECURSIVE_RUN_FIRST_FAIL Evidence gap ×32 5.3.0 executionContext=node · moduleSystem=esm · os=windows · runtime=node@24.13 sha256:9f91c9753081…(node:<n>) ExperimentalWarning: SQLite is an experimental feature and might change at any time …pnpm · unclassified-diagnostic · outer pnpm · gap stage-unknownEvidence quality: complete · Environment variants: 1 · First recorded: 2026-09-01 · Last seen: 2026-09-17Diagnostic re-verification candidate
-
observed UNKNOWN exit 1 ERR_PNPM_RECURSIVE_EXEC_FIRST_FAIL Evidence gap ×28 5.3.0 executionContext=node · moduleSystem=esm · os=windows · runtime=node@24.13 sha256:979755e6489d…(node:<n>) ExperimentalWarning: SQLite is an experimental feature and might change at any time …pnpm · unclassified-diagnostic · outer pnpm · gap stage-unknownEvidence quality: complete · Environment variants: 1 · First recorded: 2026-09-01 · Last seen: 2026-09-15Diagnostic re-verification candidate
-
observed UNKNOWN exit 1 ERR_PNPM_RECURSIVE_EXEC_FIRST_FAIL Evidence gap ×11 5.3.0 executionContext=node · moduleSystem=esm · os=windows · runtime=node@24.13 sha256:73873d2c4aed…<str> is not recognized as an internal or external command, · operable program or batch file. · undefined …pnpm · unclassified-diagnostic · outer pnpm · gap stage-unknownEvidence quality: complete · Environment variants: 1 · First recorded: 2026-09-01 · Last seen: 2026-09-01Diagnostic re-verification candidate
-
observed PROJECT_TEST exit 1 ELIFECYCLE ×10 5.3.0 executionContext=node · moduleSystem=esm · os=windows · runtime=node@24.13 sha256:7711694d48fa…ELIFECYCLE Test failed. See above for more details.javascript/test-runner · test-runner-diagnostic · outer pnpm testEvidence quality: complete · Environment variants: 1 · First recorded: 2026-08-29 · Last seen: 2026-09-01
-
observed PROJECT_PROCESS ERR_ASSERTION Evidence gap ×8 5.3.0 executionContext=nodeEvidence quality: legacy-evidence-incomplete · Environment variants: 3 · First recorded: 2026-08-18 · Last seen: 2026-08-29Diagnostic re-verification candidate
-
observed PROJECT_COMPILE exit 2 TS2307 ×8 4.3.0 → 5.3.0 executionContext=node · moduleSystem=cjs · os=windows · runtime=node@24.13 sha256:0470f88d95bb…lib/hooks/queries/index.ts(<n>,<n>): error TS2307: Cannot find module <str> or its corresponding type declarations. …typescript/tsc · compiler-diagnosticEvidence quality: complete · Environment variants: 1 · First recorded: 2026-09-01 · Last seen: 2026-09-01
-
observed PROJECT_COMPILE exit 2 TS7006 ×8 4.3.0 → 5.3.0 executionContext=node · moduleSystem=cjs · os=windows · runtime=node@24.13 sha256:21025cd78572…app/api/politicians/[id]/real-estates/route.ts(<n>,<n>): error TS7006: Parameter <str> implicitly has an <str> type. …typescript/tsc · compiler-diagnosticEvidence quality: complete · Environment variants: 1 · First recorded: 2026-09-01 · Last seen: 2026-09-01
-
observed PROJECT_COMPILE exit 2 TS2561 ×8 4.3.0 → 5.3.0 executionContext=node · moduleSystem=cjs · os=windows · runtime=node@24.13 sha256:5f96e966539e…app/api/politicians/[id]/real-estates/route.ts(<n>,<n>): error TS2561: Object literal may only specify known properties, but <str> does not exist in type …typescript/tsc · compiler-diagnosticEvidence quality: complete · Environment variants: 1 · First recorded: 2026-09-01 · Last seen: 2026-09-01
-
observed PROJECT_COMPILE exit 2 TS2345 ×8 4.3.0 → 5.3.0 executionContext=node · moduleSystem=cjs · os=windows · runtime=node@24.13 sha256:7e077f646acc…lib/api/real-estate-statistics.ts(<n>,<n>): error TS2345: Argument of type <str> is not assignable to parameter of type <str>.typescript/tsc · compiler-diagnosticEvidence quality: complete · Environment variants: 1 · First recorded: 2026-09-01 · Last seen: 2026-09-01
-
observed PROJECT_COMPILE exit 2 TS2551 ×8 4.3.0 → 5.3.0 executionContext=node · moduleSystem=cjs · os=windows · runtime=node@24.13 sha256:8a1ebc675f2b…app/api/politicians/[id]/real-estates/route.ts(<n>,<n>): error TS2551: Property <str> does not exist on type <str>. Did you mean <str>? …typescript/tsc · compiler-diagnosticEvidence quality: complete · Environment variants: 1 · First recorded: 2026-09-01 · Last seen: 2026-09-01
-
observed PROJECT_COMPILE exit 2 TS2339 ×8 4.3.0 → 5.3.0 executionContext=node · moduleSystem=cjs · os=windows · runtime=node@24.13 sha256:e51205820175…lib/api/real-estate-map-addresses.ts(<n>,<n>): error TS2339: Property <str> does not exist on type <str>.typescript/tsc · compiler-diagnosticEvidence quality: complete · Environment variants: 1 · First recorded: 2026-09-01 · Last seen: 2026-09-01
-
observed PROJECT_COMPILE exit 2 TS2305 ×8 4.3.0 → 5.3.0 executionContext=node · moduleSystem=cjs · os=windows · runtime=node@24.13 sha256:e7aa54217e13…app/api/politicians/[id]/real-estates/route.ts(<n>,<n>): error TS2305: Module <str> has no exported member <str>. …typescript/tsc · compiler-diagnosticEvidence quality: complete · Environment variants: 1 · First recorded: 2026-09-01 · Last seen: 2026-09-01
Showing the 12 most-reported of 246 recorded failure clusters. The rest are single reports.