记录npmescape-string-regexp4.0.0escapeStringRegexp
更改条件
依赖健康度
某次解析读取了该版本的依赖树,没有发现依赖。这是一次测量结果,而不是缺失。
近期失败聚类
-
已观测 UNKNOWN exit 1 证据缺口 ×15 4.0.0 executionContext=node · moduleSystem=cjs · os=linux · runtime=node@22.23 sha256:9be950af9140…Traceback (most recent call last): · File <str>, line 1, in <module> · ModuleNotFoundError: No module named <str>python3 · unclassified-diagnostic · outer python3 · gap stage-unknown证据质量: complete · 环境变体: 1 · 首次记录: 2026-08-30 · 最近观测: 2026-08-31诊断复验候选
-
已观测 PROJECT_PROCESS ERR_PACKAGE_PATH_NOT_EXPORTED 证据缺口 ×11 2.0.0 → 4.0.0 executionContext=node · os=linux · runtime=node@22.23证据质量: legacy-evidence-incomplete · 环境变体: 2 · 首次记录: 2026-08-29 · 最近观测: 2026-08-30诊断复验候选
-
已观测 UNKNOWN exit 1 ERR_ASSERTION 证据缺口 ×7 1.0.5 → 2.0.0 → 4.0.0 → 5.0.0 executionContext=node · os=linux · runtime=node@22.23 sha256:986d98189e70…node:internal/modules/run_main:<n> · triggerUncaughtException( · ^ · AssertionError [ERR_ASSERTION]: Expected values to be strictly equal:node · unclassified-diagnostic · outer node · gap stage-unknown证据质量: complete · 环境变体: 2 · 首次记录: 2026-08-29 · 最近观测: 2026-09-17诊断复验候选
-
已观测 PROCESS_START process start failed 证据缺口 ×7 4.0.0 executionContext=node sha256:c12549970456…· structured-termination · gap diagnostic-missing证据质量: partial · 环境变体: 2 · 首次记录: 2026-08-30 · 最近观测: 2026-09-16诊断复验候选
-
已观测 UNKNOWN exit 1 证据缺口 ×6 2.0.0 → 4.0.0 executionContext=node · moduleSystem=cjs · os=linux · runtime=node@22.23 sha256:91ad26545eb1…node:internal/modules/cjs/loader:<n> · throw err; · ^ · Error: Cannot find module <str>node · unclassified-diagnostic · outer node · gap stage-unknown证据质量: complete · 环境变体: 1 · 首次记录: 2026-08-30 · 最近观测: 2026-09-06诊断复验候选
-
已观测 UNKNOWN exit 2 证据缺口 ×4 4.0.0 executionContext=node · moduleSystem=cjs · os=linux · runtime=node@22.23 sha256:fddf8ea09045…Using CPython 3.12.3 interpreter at: <path> · Creating virtual environment at: .venv · error: Failed to create virtual environment …· unclassified-diagnostic · gap stage-unknown证据质量: complete · 环境变体: 1 · 首次记录: 2026-08-30 · 最近观测: 2026-08-31诊断复验候选
-
已观测 UNKNOWN exit 1 证据缺口 ×4 4.0.0 executionContext=node · moduleSystem=cjs · os=linux · runtime=node@22.23 sha256:72ba2d1e946f…<path>: No module named pippython3 · unclassified-diagnostic · outer python3 · gap stage-unknown证据质量: complete · 环境变体: 1 · 首次记录: 2026-08-31 · 最近观测: 2026-08-31诊断复验候选
-
已观测 UNKNOWN exit 1 ERR_ASSERTION 证据缺口 ×2 4.0.0 executionContext=node · moduleSystem=esm · os=linux · runtime=node@22.23 sha256:10e769edac62…node:internal/modules/run_main:<n> · triggerUncaughtException( · ^ · AssertionError [ERR_ASSERTION]: The expression evaluated to a falsy value:node · unclassified-diagnostic · outer node · gap stage-unknown证据质量: complete · 环境变体: 1 · 首次记录: 2026-08-30 · 最近观测: 2026-08-30诊断复验候选
-
已观测 UNKNOWN exit 1 证据缺口 ×2 4.0.0 executionContext=node · moduleSystem=cjs · os=linux · runtime=node@22.23 sha256:1a59d865df9a…<path>:<n> · throw new Error( · ^ · Error: This method cannot be used with flat config. Add your entries directly into the config array.node · unclassified-diagnostic · outer node · gap stage-unknown证据质量: complete · 环境变体: 1 · 首次记录: 2026-08-30 · 最近观测: 2026-08-30诊断复验候选
-
已观测 UNKNOWN exit 1 证据缺口 ×2 4.0.0 executionContext=node · os=linux · runtime=node@22.23 sha256:0bd98c410653…<path>:<n> · param.decorators.forEach(d => this.visit(d)); · ^ · TypeError: Cannot read properties of undefined (reading <str>)node · unclassified-diagnostic · outer node · gap stage-unknown证据质量: complete · 环境变体: 2 · 首次记录: 2026-09-05 · 最近观测: 2026-09-05诊断复验候选
-
已观测 UNKNOWN exit 1 证据缺口 ×1 4.0.0 executionContext=node · moduleSystem=cjs · os=linux · runtime=node@22.23 sha256:6370f8688b49…Contract test failed: Error: Cannot find module <str> · Require stack: · - <path> · - <path>node · unclassified-diagnostic · outer node · gap stage-unknown证据质量: complete · 环境变体: 1 · 首次记录: 2026-08-29 · 最近观测: 2026-08-29诊断复验候选
-
已观测 UNKNOWN exit 1 ERR_ASSERTION 证据缺口 ×1 4.0.0 executionContext=node · moduleSystem=cjs · os=linux · runtime=node@22.23 sha256:f326878dcad5…AssertionError [ERR_ASSERTION]: App declaration must contain <str> method · at runTests (<path>:<n>:<n>) · at Object.<anonymous> (<path>:<n>:<n>) …node · unclassified-diagnostic · outer node · gap stage-unknown证据质量: complete · 环境变体: 1 · 首次记录: 2026-08-29 · 最近观测: 2026-08-29诊断复验候选
显示报告最多的 12 个。此坐标记录的失败聚类共 45 个。其余为单次报告。