Aufzeichnungennpmesbuild0.25.12esbuild.transform
Bedingungen ändern
Aktuelle Bedingungen
esbuild.transform @0.25.12alpine musl · x64 · node 22 · npm · node
2 von 2 bestanden
Verifiziert — dieses Netzwerk hat an dieser Koordinate einen Contract ausgeführt.
hier gibt es ein Sample, und unser Lauf an dieser Koordinate kam sauber zurück (1)
- Projektbeobachtungen
- 1 / 1
- Contract-Verifikationen
- 2 / 2
- Unabhängig meldende Peers
- 1
- Gegengeprüft
- von zwei oder mehr unabhängigen Peers reproduziert
- Zuletzt erfasst
- 2026-09-08
Nachweise zum Öffnen
Abhängigkeits-Zustand
Eine Auflösung hat den Baum dieses Releases gelesen und keine Abhängigkeiten gefunden. Das ist eine Messung, keine fehlende.
Aktuelle Fehler-Cluster
-
beobachtet PROCESS_START process start failed Beweislücke ×36 0.21.5 → 0.25.12 → 0.28.2 executionContext=node sha256:c12549970456…· structured-termination · gap diagnostic-missingBeweisqualität: partial · Umgebungsvarianten: 3 · Zuerst erfasst: 2026-08-31 · Zuletzt gesehen: 2026-09-16Kandidat für diagnostische Neuprüfung
-
beobachtet PROJECT_PROCESS ERR_ASSERTION Beweislücke ×6 0.25.12 → 0.28.2 executionContext=node · moduleSystem=esmBeweisqualität: legacy-evidence-incomplete · Umgebungsvarianten: 2 · Zuerst erfasst: 2026-08-14 · Zuletzt gesehen: 2026-08-30Kandidat für diagnostische Neuprüfung
-
beobachtet UNKNOWN exit 1 Beweislücke ×3 0.21.5 → 0.25.12 executionContext=node · moduleSystem=esm · os=linux · runtime=node@22.23 sha256:8fd30f2a6304…fil<path>:<n> · throw new Error(errorMsg); · ^ · Error: Vitest failed to access its internal state.node · unclassified-diagnostic · outer node · gap stage-unknownBeweisqualität: complete · Umgebungsvarianten: 1 · Zuerst erfasst: 2026-08-31 · Zuletzt gesehen: 2026-09-08Kandidat für diagnostische Neuprüfung
-
beobachtet UNKNOWN exit 1 ERR_ASSERTION Beweislücke ×3 0.25.12 executionContext=node · moduleSystem=esm · os=linux · runtime=node@22.23 sha256:986d98189e70…node:internal/modules/run_main:<n> · triggerUncaughtException( · ^ · AssertionError [ERR_ASSERTION]: Expected values to be strictly equal:node · unclassified-diagnostic · outer node · gap stage-unknownBeweisqualität: complete · Umgebungsvarianten: 1 · Zuerst erfasst: 2026-09-05 · Zuletzt gesehen: 2026-09-05Kandidat für diagnostische Neuprüfung
-
beobachtet UNKNOWN exit 1 ERROR Beweislücke ×2 0.25.12 → 0.28.2 executionContext=node · moduleSystem=cjs · os=linux · runtime=node@22.23 sha256:1f882fb2e944…✘ [ERROR] Could not resolve <str> · failed to load config from <path> · <path>:<n> · let error = new Error(text);node · unclassified-diagnostic · outer node · gap stage-unknownBeweisqualität: complete · Umgebungsvarianten: 1 · Zuerst erfasst: 2026-09-04 · Zuletzt gesehen: 2026-09-04Kandidat für diagnostische Neuprüfung
-
beobachtet UNKNOWN exit 1 ERR_ASSERTION Beweislücke ×2 0.25.12 → 0.28.2 executionContext=node · moduleSystem=esm · os=linux · runtime=node@22.23 sha256:ac1a96fa941c…Contract test failed: AssertionError [ERR_ASSERTION]: out/preload/index.js must be created by build · at run (<url>) { · generatedMessage: false, …node · unclassified-diagnostic · outer node · gap stage-unknownBeweisqualität: complete · Umgebungsvarianten: 1 · Zuerst erfasst: 2026-09-06 · Zuletzt gesehen: 2026-09-06Kandidat für diagnostische Neuprüfung