Aufzeichnungennpmes-errors1.3.0es-errors/type
Bedingungen ändern
Aktuelle Bedingungen
es-errors/type @1.3.0alpine musl · x64 · node 22 · npm · node
2 von 2 bestanden
Verifiziert — dieses Netzwerk hat an dieser Koordinate einen Contract ausgeführt.
hier gibt es ein Sample, und unser Lauf an dieser Koordinate kam sauber zurück (1)
- Projektbeobachtungen
- 1 / 1
- Contract-Verifikationen
- 2 / 2
- Unabhängig meldende Peers
- 1
- Gegengeprüft
- von zwei oder mehr unabhängigen Peers reproduziert
- Zuletzt erfasst
- 2026-09-12
Nachweise zum Öffnen
Abhängigkeits-Zustand
Eine Auflösung hat den Baum dieses Releases gelesen und keine Abhängigkeiten gefunden. Das ist eine Messung, keine fehlende.
Aktuelle Fehler-Cluster
-
beobachtet PROJECT_PROCESS ERR_MODULE_NOT_FOUND Beweislücke ×24 1.3.0 executionContext=nodeBeweisqualität: legacy-evidence-incomplete · Umgebungsvarianten: 2 · Zuerst erfasst: 2026-08-13 · Zuletzt gesehen: 2026-08-29Kandidat für diagnostische Neuprüfung
-
beobachtet UNKNOWN exit 1 Beweislücke ×16 1.3.0 executionContext=node · moduleSystem=cjs · os=linux · runtime=node@22.23 sha256:9be950af9140…Traceback (most recent call last): · File <str>, line 1, in <module> · ModuleNotFoundError: No module named <str>python3 · unclassified-diagnostic · outer python3 · gap stage-unknownBeweisqualität: complete · Umgebungsvarianten: 1 · Zuerst erfasst: 2026-08-30 · Zuletzt gesehen: 2026-08-31Kandidat für diagnostische Neuprüfung
-
beobachtet PROCESS_START process start failed Beweislücke ×9 1.3.0 executionContext=node sha256:c12549970456…· structured-termination · gap diagnostic-missingBeweisqualität: partial · Umgebungsvarianten: 3 · Zuerst erfasst: 2026-08-30 · Zuletzt gesehen: 2026-09-16Kandidat für diagnostische Neuprüfung
-
beobachtet UNKNOWN exit 1 ERR_MODULE_NOT_FOUND Beweislücke ×5 1.3.0 executionContext=node · moduleSystem=cjs · os=linux · runtime=node@22.23 sha256:88af852f99a8…node:internal/modules/package_json_reader:<n> · throw new ERR_MODULE_NOT_FOUND(packageName, fileURLToPath(base), null); · ^ …node · unclassified-diagnostic · outer node · gap stage-unknownBeweisqualität: complete · Umgebungsvarianten: 1 · Zuerst erfasst: 2026-09-03 · Zuletzt gesehen: 2026-09-05Kandidat für diagnostische Neuprüfung
-
beobachtet UNKNOWN exit 1 Beweislücke ×4 1.3.0 executionContext=node · moduleSystem=cjs · os=linux · runtime=node@22.23 sha256:91ad26545eb1…node:internal/modules/cjs/loader:<n> · throw err; · ^ · Error: Cannot find module <str>node · unclassified-diagnostic · outer node · gap stage-unknownBeweisqualität: complete · Umgebungsvarianten: 1 · Zuerst erfasst: 2026-08-30 · Zuletzt gesehen: 2026-08-31Kandidat für diagnostische Neuprüfung
-
beobachtet UNKNOWN exit 2 Beweislücke ×4 1.3.0 executionContext=node · moduleSystem=cjs · os=linux · runtime=node@22.23 sha256:fddf8ea09045…Using CPython 3.12.3 interpreter at: <path> · Creating virtual environment at: .venv · error: Failed to create virtual environment …· unclassified-diagnostic · gap stage-unknownBeweisqualität: complete · Umgebungsvarianten: 1 · Zuerst erfasst: 2026-08-30 · Zuletzt gesehen: 2026-08-31Kandidat für diagnostische Neuprüfung
-
beobachtet UNKNOWN exit 1 Beweislücke ×4 1.3.0 executionContext=node · moduleSystem=cjs · os=linux · runtime=node@22.23 sha256:72ba2d1e946f…<path>: No module named pippython3 · unclassified-diagnostic · outer python3 · gap stage-unknownBeweisqualität: complete · Umgebungsvarianten: 1 · Zuerst erfasst: 2026-08-31 · Zuletzt gesehen: 2026-08-31Kandidat für diagnostische Neuprüfung
-
beobachtet UNKNOWN exit 1 ERR_ASSERTION Beweislücke ×3 1.3.0 executionContext=node · os=linux · runtime=node@22.23 sha256:986d98189e70…node:internal/modules/run_main:<n> · triggerUncaughtException( · ^ · AssertionError [ERR_ASSERTION]: Expected values to be strictly equal:node · unclassified-diagnostic · outer node · gap stage-unknownBeweisqualität: complete · Umgebungsvarianten: 2 · Zuerst erfasst: 2026-08-31 · Zuletzt gesehen: 2026-09-03Kandidat für diagnostische Neuprüfung
-
beobachtet UNKNOWN exit 1 ERR_MODULE_NOT_FOUND Beweislücke ×2 1.3.0 executionContext=node · moduleSystem=esm · os=linux · runtime=node@22.23 sha256:a4c16095efc0…node:internal/modules/run_main:<n> · triggerUncaughtException( · ^ · Error [ERR_MODULE_NOT_FOUND]: Cannot find module <str> imported from <path>node · unclassified-diagnostic · outer node · gap stage-unknownBeweisqualität: complete · Umgebungsvarianten: 1 · Zuerst erfasst: 2026-09-03 · Zuletzt gesehen: 2026-09-05Kandidat für diagnostische Neuprüfung
-
beobachtet UNKNOWN exit 1 Beweislücke ×2 1.3.0 executionContext=node · moduleSystem=cjs · os=linux · runtime=node@22.23 sha256:3b3190f2cd44…doc: cannot find package <str> in any of: · ($GOROOT not set) · <path> (from $GOPATH)go · unclassified-diagnostic · outer go · gap stage-unknownBeweisqualität: complete · Umgebungsvarianten: 1 · Zuerst erfasst: 2026-09-04 · Zuletzt gesehen: 2026-09-04Kandidat für diagnostische Neuprüfung
-
beobachtet UNKNOWN exit 1 Beweislücke ×2 1.3.0 executionContext=node · moduleSystem=cjs · os=linux · runtime=node@22.23 sha256:f0288eb0529f…Traceback (most recent call last): · File <str>, line 19, in <module> · AssertionError· unclassified-diagnostic · gap stage-unknownBeweisqualität: complete · Umgebungsvarianten: 1 · Zuerst erfasst: 2026-09-04 · Zuletzt gesehen: 2026-09-04Kandidat für diagnostische Neuprüfung
-
beobachtet UNKNOWN exit 1 Beweislücke ×1 1.3.0 executionContext=node · moduleSystem=cjs · os=linux · runtime=node@22.23 sha256:6370f8688b49…Contract test failed: Error: Cannot find module <str> · Require stack: · - <path> · - <path>node · unclassified-diagnostic · outer node · gap stage-unknownBeweisqualität: complete · Umgebungsvarianten: 1 · Zuerst erfasst: 2026-08-29 · Zuletzt gesehen: 2026-08-29Kandidat für diagnostische Neuprüfung
Es werden die 12 meistgemeldeten von 66 aufgezeichneten Fehlerclustern gezeigt. Der Rest sind Einzelmeldungen.