Registrosnpmentities4.5.0
Mudar as condições
Condições atuais
entities @4.5.0ubuntu glibc · x64 · node 22 · npm 10 · node
total do pacote, não uma API
0 de 10 passaram
Verificado — esta rede executou um contrato nesta coordenada.
há uma amostra aqui e nossa execução nesta coordenada falhou
- Observações de projetos
- 70 / 70
- Verificações de contrato
- 0 / 10
- Registros de uso
- 12
- Peers independentes que reportaram
- 1
- Último registro
- 2026-09-19
Evidências que você pode abrir
Saúde das dependências
Uma resolução leu a árvore desta versão e não encontrou dependências. Isso é uma medição, não uma medição ausente.
Clusters de falha recentes
-
observado UNKNOWN exit 1 ERR_ASSERTION Lacuna de evidência ×9 4.5.0 → 6.0.1 → 7.0.1 executionContext=node · os=linux · runtime=node@22.23 sha256:986d98189e70…node:internal/modules/run_main:<n> · triggerUncaughtException( · ^ · AssertionError [ERR_ASSERTION]: Expected values to be strictly equal:node · unclassified-diagnostic · outer node · gap stage-unknownQualidade da evidência: complete · Variantes de ambiente: 2 · Primeiro registro: 2026-08-30 · Visto por último: 2026-09-19Candidato a reverificação diagnóstica
-
observado UNKNOWN exit 1 ERR_ASSERTION Lacuna de evidência ×2 4.5.0 executionContext=node · moduleSystem=cjs · os=linux · runtime=node@22.23 sha256:3ad0f21f8b08…Contract test failed: AssertionError [ERR_ASSERTION]: Expected values to be strictly equal: · + actual - expected · + <str> · - <str>node · unclassified-diagnostic · outer node · gap stage-unknownQualidade da evidência: complete · Variantes de ambiente: 1 · Primeiro registro: 2026-09-19 · Visto por último: 2026-09-19Candidato a reverificação diagnóstica
-
observado UNKNOWN exit 1 ERR_ASSERTION Lacuna de evidência ×1 4.5.0 executionContext=node · moduleSystem=cjs · os=linux · runtime=node@22.23 sha256:f0f7ba6c14b3…node:internal/modules/run_main:<n> · triggerUncaughtException( · ^ · AssertionError [ERR_ASSERTION]: zero preset must disable inline formatting rulesnode · unclassified-diagnostic · outer node · gap stage-unknownQualidade da evidência: complete · Variantes de ambiente: 1 · Primeiro registro: 2026-09-15 · Visto por último: 2026-09-15Candidato a reverificação diagnóstica
-
observado UNKNOWN exit 1 ERR_ASSERTION Lacuna de evidência ×1 4.5.0 executionContext=node · moduleSystem=cjs · os=linux · runtime=node@22.23 sha256:f177b90eaac2…node:internal/modules/run_main:<n> · triggerUncaughtException( · ^ …node · unclassified-diagnostic · outer node · gap stage-unknownQualidade da evidência: complete · Variantes de ambiente: 1 · Primeiro registro: 2026-09-15 · Visto por último: 2026-09-15Candidato a reverificação diagnóstica
-
observado UNKNOWN exit 1 Lacuna de evidência ×1 4.5.0 executionContext=node · moduleSystem=esm · os=linux · runtime=node@22.23 sha256:37e6355fb7d3…fil<path>:<n> · throw new RangeError(<str> + pos + <str>); · ^ · RangeError: Position 100 out of rangenode · unclassified-diagnostic · outer node · gap stage-unknownQualidade da evidência: complete · Variantes de ambiente: 1 · Primeiro registro: 2026-09-17 · Visto por último: 2026-09-17Candidato a reverificação diagnóstica
-
observado UNKNOWN exit 1 ERR_PACKAGE_PATH_NOT_EXPORTED Lacuna de evidência ×1 4.5.0 executionContext=node · moduleSystem=esm · os=linux · runtime=node@22.23 sha256:76c8bae9d497…node:internal/modules/esm/resolve:<n> · return new ERR_PACKAGE_PATH_NOT_EXPORTED( · ^ …node · unclassified-diagnostic · outer node · gap stage-unknownQualidade da evidência: complete · Variantes de ambiente: 1 · Primeiro registro: 2026-09-17 · Visto por último: 2026-09-17Candidato a reverificação diagnóstica