Recordsnpmentities4.5.0
Change the conditions
Current conditions
entities @4.5.0ubuntu glibc · x64 · node 22 · npm 10 · node
package-level total, not an API
0 of 10 passed
Verified — this network ran a contract at this coordinate.
there is a sample here, and our run of it at this coordinate failed
- Project observations
- 70 / 70
- Contract verifications
- 0 / 10
- Usage records
- 12
- Independent reporting peers
- 1
- Last recorded
- 2026-09-19
Evidence you can open
Dependency Health
A resolution read this release's tree and found no dependencies. That is a measurement, not a missing one.
Recent failure clusters
-
observed UNKNOWN exit 1 ERR_ASSERTION Evidence gap ×9 4.5.0 → 6.0.1 → 7.0.1 executionContext=node · os=linux · runtime=node@22.23 sha256:986d98189e70…node:internal/modules/run_main:<n> · triggerUncaughtException( · ^ · AssertionError [ERR_ASSERTION]: Expected values to be strictly equal:node · unclassified-diagnostic · outer node · gap stage-unknownEvidence quality: complete · Environment variants: 2 · First recorded: 2026-08-30 · Last seen: 2026-09-19Diagnostic re-verification candidate
-
observed UNKNOWN exit 1 ERR_ASSERTION Evidence gap ×2 4.5.0 executionContext=node · moduleSystem=cjs · os=linux · runtime=node@22.23 sha256:3ad0f21f8b08…Contract test failed: AssertionError [ERR_ASSERTION]: Expected values to be strictly equal: · + actual - expected · + <str> · - <str>node · unclassified-diagnostic · outer node · gap stage-unknownEvidence quality: complete · Environment variants: 1 · First recorded: 2026-09-19 · Last seen: 2026-09-19Diagnostic re-verification candidate
-
observed UNKNOWN exit 1 ERR_ASSERTION Evidence gap ×1 4.5.0 executionContext=node · moduleSystem=cjs · os=linux · runtime=node@22.23 sha256:f0f7ba6c14b3…node:internal/modules/run_main:<n> · triggerUncaughtException( · ^ · AssertionError [ERR_ASSERTION]: zero preset must disable inline formatting rulesnode · unclassified-diagnostic · outer node · gap stage-unknownEvidence quality: complete · Environment variants: 1 · First recorded: 2026-09-15 · Last seen: 2026-09-15Diagnostic re-verification candidate
-
observed UNKNOWN exit 1 ERR_ASSERTION Evidence gap ×1 4.5.0 executionContext=node · moduleSystem=cjs · os=linux · runtime=node@22.23 sha256:f177b90eaac2…node:internal/modules/run_main:<n> · triggerUncaughtException( · ^ …node · unclassified-diagnostic · outer node · gap stage-unknownEvidence quality: complete · Environment variants: 1 · First recorded: 2026-09-15 · Last seen: 2026-09-15Diagnostic re-verification candidate
-
observed UNKNOWN exit 1 Evidence gap ×1 4.5.0 executionContext=node · moduleSystem=esm · os=linux · runtime=node@22.23 sha256:37e6355fb7d3…fil<path>:<n> · throw new RangeError(<str> + pos + <str>); · ^ · RangeError: Position 100 out of rangenode · unclassified-diagnostic · outer node · gap stage-unknownEvidence quality: complete · Environment variants: 1 · First recorded: 2026-09-17 · Last seen: 2026-09-17Diagnostic re-verification candidate
-
observed UNKNOWN exit 1 ERR_PACKAGE_PATH_NOT_EXPORTED Evidence gap ×1 4.5.0 executionContext=node · moduleSystem=esm · os=linux · runtime=node@22.23 sha256:76c8bae9d497…node:internal/modules/esm/resolve:<n> · return new ERR_PACKAGE_PATH_NOT_EXPORTED( · ^ …node · unclassified-diagnostic · outer node · gap stage-unknownEvidence quality: complete · Environment variants: 1 · First recorded: 2026-09-17 · Last seen: 2026-09-17Diagnostic re-verification candidate