Relevésnpmentities4.5.0
Changer les conditions
Conditions actuelles
entities @4.5.0ubuntu glibc · x64 · node 22 · npm 10 · node
total du paquet, pas une API
0 sur 10 ont réussi
Vérifié — ce réseau a exécuté un contrat à cette coordonnée.
il y a un échantillon ici et notre exécution à cette coordonnée a échoué
- Observations de projets
- 70 / 70
- Vérifications de contrat
- 0 / 10
- Enregistrements d'usage
- 12
- Pairs rapporteurs indépendants
- 1
- Dernier enregistrement
- 2026-09-19
Preuves que vous pouvez ouvrir
Santé des dépendances
Une résolution a lu l'arbre de cette version et n'a trouvé aucune dépendance. C'est une mesure, pas une mesure manquante.
Clusters d'échecs récents
-
observé UNKNOWN exit 1 ERR_ASSERTION Lacune de preuve ×9 4.5.0 → 6.0.1 → 7.0.1 executionContext=node · os=linux · runtime=node@22.23 sha256:986d98189e70…node:internal/modules/run_main:<n> · triggerUncaughtException( · ^ · AssertionError [ERR_ASSERTION]: Expected values to be strictly equal:node · unclassified-diagnostic · outer node · gap stage-unknownQualité de preuve: complete · Variantes d’environnement: 2 · Premier relevé: 2026-08-30 · Dernière observation: 2026-09-19Candidat à une revérification diagnostique
-
observé UNKNOWN exit 1 ERR_ASSERTION Lacune de preuve ×2 4.5.0 executionContext=node · moduleSystem=cjs · os=linux · runtime=node@22.23 sha256:3ad0f21f8b08…Contract test failed: AssertionError [ERR_ASSERTION]: Expected values to be strictly equal: · + actual - expected · + <str> · - <str>node · unclassified-diagnostic · outer node · gap stage-unknownQualité de preuve: complete · Variantes d’environnement: 1 · Premier relevé: 2026-09-19 · Dernière observation: 2026-09-19Candidat à une revérification diagnostique
-
observé UNKNOWN exit 1 ERR_ASSERTION Lacune de preuve ×1 4.5.0 executionContext=node · moduleSystem=cjs · os=linux · runtime=node@22.23 sha256:f0f7ba6c14b3…node:internal/modules/run_main:<n> · triggerUncaughtException( · ^ · AssertionError [ERR_ASSERTION]: zero preset must disable inline formatting rulesnode · unclassified-diagnostic · outer node · gap stage-unknownQualité de preuve: complete · Variantes d’environnement: 1 · Premier relevé: 2026-09-15 · Dernière observation: 2026-09-15Candidat à une revérification diagnostique
-
observé UNKNOWN exit 1 ERR_ASSERTION Lacune de preuve ×1 4.5.0 executionContext=node · moduleSystem=cjs · os=linux · runtime=node@22.23 sha256:f177b90eaac2…node:internal/modules/run_main:<n> · triggerUncaughtException( · ^ …node · unclassified-diagnostic · outer node · gap stage-unknownQualité de preuve: complete · Variantes d’environnement: 1 · Premier relevé: 2026-09-15 · Dernière observation: 2026-09-15Candidat à une revérification diagnostique
-
observé UNKNOWN exit 1 Lacune de preuve ×1 4.5.0 executionContext=node · moduleSystem=esm · os=linux · runtime=node@22.23 sha256:37e6355fb7d3…fil<path>:<n> · throw new RangeError(<str> + pos + <str>); · ^ · RangeError: Position 100 out of rangenode · unclassified-diagnostic · outer node · gap stage-unknownQualité de preuve: complete · Variantes d’environnement: 1 · Premier relevé: 2026-09-17 · Dernière observation: 2026-09-17Candidat à une revérification diagnostique
-
observé UNKNOWN exit 1 ERR_PACKAGE_PATH_NOT_EXPORTED Lacune de preuve ×1 4.5.0 executionContext=node · moduleSystem=esm · os=linux · runtime=node@22.23 sha256:76c8bae9d497…node:internal/modules/esm/resolve:<n> · return new ERR_PACKAGE_PATH_NOT_EXPORTED( · ^ …node · unclassified-diagnostic · outer node · gap stage-unknownQualité de preuve: complete · Variantes d’environnement: 1 · Premier relevé: 2026-09-17 · Dernière observation: 2026-09-17Candidat à une revérification diagnostique