Registrosnpmelectron-updater6.8.9electron-updater.DOWNLOAD_PROGRESS
Cambiar las condiciones
Condiciones actuales
electron-updater.DOWNLOAD_PROGRESS @6.8.9ubuntu glibc · x64 · node 22 · npm 10 · node
0 de 12 pasaron
Verificado: esta red ejecutó un contrato en esta coordenada.
hay una muestra aquí y nuestra ejecución en esta coordenada falló
- Observaciones de proyectos
- 12 / 14
- Verificaciones de contrato
- 0 / 12
- Peers independientes que reportaron
- 2
- Último registro
- 2026-08-30
Salud de dependencias
Combinaciones observadas y evidencia de fallos para esta versión
Primer fallo observado
6.8.9
windows · node@24.13 · moduleSystem=esm · executionContext=node
32 FAIL
· stage: UNKNOWN
· fingerprint: sha256:9f91c975308128a0f4f23e33b9d5936b9c39535b5c01aa9245b8cdc4b0a37a10
| Biblioteca | Versión | Estado | Medido allí | Proyectos |
|---|---|---|---|---|
| builder-util-runtime | 9.7.0 | CANDIDATE Cambio correlacionado; combinación no probada | contrato aprobado | 14 días-proyecto |
| semver | 7.7.4 | CANDIDATE Cambio correlacionado; combinación no probada | contrato aprobado | 13 días-proyecto |
| fs-extra | 10.1.0 | PASS Todas las observaciones pasaron | contrato aprobado | 14 días-proyecto |
| js-yaml | 4.3.0 | PASS Todas las observaciones pasaron | contrato aprobado | 3 días-proyecto |
| js-yaml | 4.3.1 | PASS Todas las observaciones pasaron | contrato aprobado | 11 días-proyecto |
| js-yaml | 4.3.2 | PASS Todas las observaciones pasaron | contrato aprobado | 3 días-proyecto |
| lazy-val | 1.0.5 | PASS Todas las observaciones pasaron | contrato aprobado | 14 días-proyecto |
| lodash.escaperegexp | 4.1.2 | PASS Todas las observaciones pasaron | contrato aprobado | 14 días-proyecto |
| lodash.isequal | 4.5.0 | PASS Todas las observaciones pasaron | contrato aprobado | 13 días-proyecto |
| tiny-typed-emitter | 2.1.0 | PASS Todas las observaciones pasaron | contrato aprobado | 10 días-proyecto |
La columna de medición se refiere a la versión de cada dependencia en sí, no al par. Que un resolutor haya colocado dos versiones juntas no prueba que funcionen juntas.
Versiones de dependencias por versión
A qué resolvió sus hijos cada versión de este paquete. Primero va el hijo cuya versión se movió: ahí una actualización cambió algo bajo tus pies.
Se movieron: 2 · iguales en todas las versiones: 6
Una arista registra que un resolutor colocó una versión junto a otra en una máquina real. No afirma que ambas funcionen juntas; a esa pregunta responden las muestras y los contratos, no la presencia de una fila.
Clústeres de fallos recientes
-
observado UNKNOWN exit 1 Brecha de evidencia ×3 6.8.9 executionContext=node · moduleSystem=cjs · os=linux · runtime=node@22.23 electron-updater.DOWNLOAD_PROGRESS sha256:91ad26545eb1…node:internal/modules/cjs/loader:<n> · throw err; · ^ · Error: Cannot find module <str>node · unclassified-diagnostic · outer node · gap stage-unknownCalidad de evidencia: complete · Variantes de entorno: 1 · Primer registro: 2026-08-29 · Última observación: 2026-08-30Candidato a reverificación diagnóstica
-
observado PROJECT_TEST exit 1 ERR_ASSERTION ×2 6.8.9 executionContext=node · moduleSystem=cjs · os=linux · runtime=node@22.23 electron-updater.DOWNLOAD_PROGRESS sha256:45fc70285a65…Contract test failed: AssertionError [ERR_ASSERTION]: DOWNLOAD_PROGRESS event should have fired · false !== true · at main (<path>:<n>:<n>) { …javascript/test-runner · test-runner-diagnostic · outer npm testCalidad de evidencia: complete · Variantes de entorno: 1 · Primer registro: 2026-08-29 · Última observación: 2026-08-29
-
observado UNKNOWN exit 1 Brecha de evidencia ×1 6.8.9 executionContext=node · moduleSystem=cjs · os=linux · runtime=node@22.23 electron-updater.DOWNLOAD_PROGRESS sha256:8310a83be884…node:internal/modules/cjs/loader:<n> · const err = new Error(message); · ^ · Error: Cannot find module <str>node · unclassified-diagnostic · outer node · gap stage-unknownCalidad de evidencia: complete · Variantes de entorno: 1 · Primer registro: 2026-08-29 · Última observación: 2026-08-29Candidato a reverificación diagnóstica
-
observado UNKNOWN exit 1 ERR_MODULE_NOT_FOUND Brecha de evidencia ×1 6.8.9 executionContext=node · moduleSystem=cjs · os=linux · runtime=node@22.23 electron-updater.DOWNLOAD_PROGRESS sha256:88af852f99a8…node:internal/modules/package_json_reader:<n> · throw new ERR_MODULE_NOT_FOUND(packageName, fileURLToPath(base), null); · ^ …node · unclassified-diagnostic · outer node · gap stage-unknownCalidad de evidencia: complete · Variantes de entorno: 1 · Primer registro: 2026-08-29 · Última observación: 2026-08-29Candidato a reverificación diagnóstica
-
observado UNKNOWN exit 1 Brecha de evidencia ×1 6.8.9 executionContext=node · moduleSystem=cjs · os=linux · runtime=node@22.23 electron-updater.DOWNLOAD_PROGRESS sha256:8e2ccedae0ba…Contract test failed: TypeError: this.doDownloadUpdate is not a function · at CustomBaseUpdater.downloadUpdate <path>:<n>:<n>) · at main (<path>:<n>:<n>) …node · unclassified-diagnostic · outer node · gap stage-unknownCalidad de evidencia: complete · Variantes de entorno: 1 · Primer registro: 2026-08-29 · Última observación: 2026-08-29Candidato a reverificación diagnóstica
-
observado UNKNOWN exit 1 Brecha de evidencia ×1 6.8.9 executionContext=node · moduleSystem=cjs · os=linux · runtime=node@22.23 electron-updater.DOWNLOAD_PROGRESS sha256:91bb8f54cd90…Contract test failed: Error: Command node exited with code 2 · at CustomBaseUpdater.spawnSyncLog <path>:<n>:<n>) · at main (<path>:<n>:<n>) …node · unclassified-diagnostic · outer node · gap stage-unknownCalidad de evidencia: complete · Variantes de entorno: 1 · Primer registro: 2026-08-29 · Última observación: 2026-08-29Candidato a reverificación diagnóstica
-
observado UNKNOWN exit 1 Brecha de evidencia ×1 6.8.9 executionContext=node · moduleSystem=cjs · os=linux · runtime=node@22.23 electron-updater.DOWNLOAD_PROGRESS sha256:9922ca80f240…go: <path> already existsgo · unclassified-diagnostic · outer go mod · gap stage-unknownCalidad de evidencia: complete · Variantes de entorno: 1 · Primer registro: 2026-08-29 · Última observación: 2026-08-29Candidato a reverificación diagnóstica
-
observado UNKNOWN exit 1 ERR_ASSERTION Brecha de evidencia ×1 6.8.9 executionContext=node · moduleSystem=cjs · os=linux · runtime=node@22.23 electron-updater.DOWNLOAD_PROGRESS sha256:07e974cf28d4…Test failed: AssertionError [ERR_ASSERTION]: getFeedURL should return configured feed url · + actual - expected · + <str> · - <str>node · unclassified-diagnostic · outer node · gap stage-unknownCalidad de evidencia: complete · Variantes de entorno: 1 · Primer registro: 2026-08-30 · Última observación: 2026-08-30Candidato a reverificación diagnóstica
-
observado UNKNOWN exit 1 ERR_ASSERTION Brecha de evidencia ×1 6.8.9 executionContext=node · moduleSystem=cjs · os=linux · runtime=node@22.23 sha256:092c90ad7c9c…Contract test failed: AssertionError [ERR_ASSERTION]: setting empty channel must throw ERR_UPDATER_INVALID_CHANNEL · at run (<path>:<n>:<n>) …node · unclassified-diagnostic · outer node · gap stage-unknownCalidad de evidencia: complete · Variantes de entorno: 1 · Primer registro: 2026-08-30 · Última observación: 2026-08-30Candidato a reverificación diagnóstica
-
observado UNKNOWN exit 1 Brecha de evidencia ×1 6.8.9 executionContext=node · moduleSystem=cjs · os=linux · runtime=node@22.23 electron-updater.DOWNLOAD_PROGRESS sha256:1c03ca490615…Traceback (most recent call last): · File <str>, line 3, in <module> · AttributeError: module <str> has no attribute <str> · IANA_VERSION: <str>python · unclassified-diagnostic · outer python · gap stage-unknownCalidad de evidencia: complete · Variantes de entorno: 1 · Primer registro: 2026-08-30 · Última observación: 2026-08-30Candidato a reverificación diagnóstica
-
observado UNKNOWN exit 1 Brecha de evidencia ×1 6.8.9 executionContext=node · moduleSystem=cjs · os=linux · runtime=node@22.23 electron-updater.DOWNLOAD_PROGRESS sha256:9be950af9140…Traceback (most recent call last): · File <str>, line 1, in <module> · ModuleNotFoundError: No module named <str>python3 · unclassified-diagnostic · outer python3 · gap stage-unknownCalidad de evidencia: complete · Variantes de entorno: 1 · Primer registro: 2026-08-30 · Última observación: 2026-08-30Candidato a reverificación diagnóstica
-
observado UNKNOWN exit 1 Brecha de evidencia ×1 6.8.9 executionContext=node · moduleSystem=cjs · os=linux · runtime=node@22.23 electron-updater.DOWNLOAD_PROGRESS sha256:d296ed2b3573…Traceback (most recent call last): · File <str>, line 5, in <module> · ModuleNotFoundError: No module named <str> · IANA_VERSION: <str>python · unclassified-diagnostic · outer python · gap stage-unknownCalidad de evidencia: complete · Variantes de entorno: 1 · Primer registro: 2026-08-30 · Última observación: 2026-08-30Candidato a reverificación diagnóstica