기록npmelectron-updater6.8.9electron-updater.AppUpdater
조건 변경
현재 조건
electron-updater.AppUpdater @6.8.9ubuntu glibc · x64 · node 22 · npm 10 · node
11회 중 0회 통과
검증 — 이 네트워크가 이 좌표에서 컨트랙트를 직접 실행했습니다.
샘플 있음 — 이 좌표에서 우리가 실행했고 실패함 (1)
- 프로젝트 관측
- 10 / 10
- 컨트랙트 검증
- 0 / 11
- 독립 보고 peer
- 3
- 마지막 기록
- 2026-08-30
열어 볼 수 있는 증거
의존성 건강도
이 릴리스의 의존성 조합과 실패 관측 결과
관측된 문제 1건 ·
변경 2건 ·
정상 8건
| 라이브러리 | 버전 | 건강도 | 그 좌표에서 측정된 것 | 프로젝트 |
|---|---|---|---|---|
| builder-util-runtime | 9.7.0 | CANDIDATE 상관 변경; 조합 결과 미증명 | 컨트랙트 통과 | 프로젝트-일 14개 |
| semver | 7.7.4 | CANDIDATE 상관 변경; 조합 결과 미증명 | 컨트랙트 통과 | 프로젝트-일 13개 |
| fs-extra | 10.1.0 | PASS 모든 관측 정상 통과 | 컨트랙트 통과 | 프로젝트-일 14개 |
| js-yaml | 4.3.0 | PASS 모든 관측 정상 통과 | 컨트랙트 통과 | 프로젝트-일 3개 |
| js-yaml | 4.3.1 | PASS 모든 관측 정상 통과 | 컨트랙트 통과 | 프로젝트-일 11개 |
| js-yaml | 4.3.2 | PASS 모든 관측 정상 통과 | 컨트랙트 통과 | 프로젝트-일 3개 |
| lazy-val | 1.0.5 | PASS 모든 관측 정상 통과 | 컨트랙트 통과 | 프로젝트-일 14개 |
| lodash.escaperegexp | 4.1.2 | PASS 모든 관측 정상 통과 | 컨트랙트 통과 | 프로젝트-일 14개 |
| lodash.isequal | 4.5.0 | PASS 모든 관측 정상 통과 | 컨트랙트 통과 | 프로젝트-일 13개 |
| tiny-typed-emitter | 2.1.0 | PASS 모든 관측 정상 통과 | 컨트랙트 통과 | 프로젝트-일 10개 |
측정 열은 각 의존성 자신의 릴리스에 대한 것이지 두 릴리스의 조합에 대한 것이 아닙니다. 리졸버가 둘을 나란히 놓았다는 사실은 함께 동작한다는 증거가 아닙니다.
릴리스별 의존성 버전
이 패키지의 릴리스마다 자식이 어떤 버전으로 해석됐는지입니다. 버전이 움직인 자식이 먼저 나옵니다 — 업그레이드가 발밑에서 무언가를 바꾼 지점입니다.
움직임: 2 · 모든 릴리스에서 동일: 6
엣지는 실제 기계에서 리졸버가 한 릴리스를 다른 릴리스 옆에 놓았다는 기록입니다. 둘이 함께 동작한다는 주장이 아닙니다. 그 질문은 여기 행이 있다는 사실이 아니라 샘플과 컨트랙트가 답합니다.
최근 실패 클러스터
-
관측됨 UNKNOWN exit 1 증거 공백 ×3 6.8.9 executionContext=node · moduleSystem=cjs · os=linux · runtime=node@22.23 electron-updater.AppUpdater sha256:91ad26545eb1…node:internal/modules/cjs/loader:<n> · throw err; · ^ · Error: Cannot find module <str>node · unclassified-diagnostic · outer node · gap stage-unknown증거 품질: complete · 환경 변형: 1 · 최초 관측: 2026-08-29 · 마지막 관측: 2026-08-30진단 재검증 후보
-
관측됨 PROJECT_TEST exit 1 ERR_ASSERTION ×2 6.8.9 executionContext=node · moduleSystem=cjs · os=linux · runtime=node@22.23 sha256:45fc70285a65…Contract test failed: AssertionError [ERR_ASSERTION]: DOWNLOAD_PROGRESS event should have fired · false !== true · at main (<path>:<n>:<n>) { …javascript/test-runner · test-runner-diagnostic · outer npm test증거 품질: complete · 환경 변형: 1 · 최초 관측: 2026-08-29 · 마지막 관측: 2026-08-29
-
관측됨 UNKNOWN exit 1 증거 공백 ×1 6.8.9 executionContext=node · moduleSystem=cjs · os=linux · runtime=node@22.23 electron-updater.AppUpdater sha256:8310a83be884…node:internal/modules/cjs/loader:<n> · const err = new Error(message); · ^ · Error: Cannot find module <str>node · unclassified-diagnostic · outer node · gap stage-unknown증거 품질: complete · 환경 변형: 1 · 최초 관측: 2026-08-29 · 마지막 관측: 2026-08-29진단 재검증 후보
-
관측됨 UNKNOWN exit 1 ERR_MODULE_NOT_FOUND 증거 공백 ×1 6.8.9 executionContext=node · moduleSystem=cjs · os=linux · runtime=node@22.23 electron-updater.AppUpdater sha256:88af852f99a8…node:internal/modules/package_json_reader:<n> · throw new ERR_MODULE_NOT_FOUND(packageName, fileURLToPath(base), null); · ^ …node · unclassified-diagnostic · outer node · gap stage-unknown증거 품질: complete · 환경 변형: 1 · 최초 관측: 2026-08-29 · 마지막 관측: 2026-08-29진단 재검증 후보
-
관측됨 UNKNOWN exit 1 증거 공백 ×1 6.8.9 executionContext=node · moduleSystem=cjs · os=linux · runtime=node@22.23 electron-updater.AppUpdater sha256:8e2ccedae0ba…Contract test failed: TypeError: this.doDownloadUpdate is not a function · at CustomBaseUpdater.downloadUpdate <path>:<n>:<n>) · at main (<path>:<n>:<n>) …node · unclassified-diagnostic · outer node · gap stage-unknown증거 품질: complete · 환경 변형: 1 · 최초 관측: 2026-08-29 · 마지막 관측: 2026-08-29진단 재검증 후보
-
관측됨 UNKNOWN exit 1 증거 공백 ×1 6.8.9 executionContext=node · moduleSystem=cjs · os=linux · runtime=node@22.23 electron-updater.AppUpdater sha256:91bb8f54cd90…Contract test failed: Error: Command node exited with code 2 · at CustomBaseUpdater.spawnSyncLog <path>:<n>:<n>) · at main (<path>:<n>:<n>) …node · unclassified-diagnostic · outer node · gap stage-unknown증거 품질: complete · 환경 변형: 1 · 최초 관측: 2026-08-29 · 마지막 관측: 2026-08-29진단 재검증 후보
-
관측됨 UNKNOWN exit 1 증거 공백 ×1 6.8.9 executionContext=node · moduleSystem=cjs · os=linux · runtime=node@22.23 electron-updater.AppUpdater sha256:9922ca80f240…go: <path> already existsgo · unclassified-diagnostic · outer go mod · gap stage-unknown증거 품질: complete · 환경 변형: 1 · 최초 관측: 2026-08-29 · 마지막 관측: 2026-08-29진단 재검증 후보
-
관측됨 UNKNOWN exit 1 ERR_ASSERTION 증거 공백 ×1 6.8.9 executionContext=node · moduleSystem=cjs · os=linux · runtime=node@22.23 electron-updater.AppUpdater sha256:07e974cf28d4…Test failed: AssertionError [ERR_ASSERTION]: getFeedURL should return configured feed url · + actual - expected · + <str> · - <str>node · unclassified-diagnostic · outer node · gap stage-unknown증거 품질: complete · 환경 변형: 1 · 최초 관측: 2026-08-30 · 마지막 관측: 2026-08-30진단 재검증 후보
-
관측됨 UNKNOWN exit 1 ERR_ASSERTION 증거 공백 ×1 6.8.9 executionContext=node · moduleSystem=cjs · os=linux · runtime=node@22.23 sha256:092c90ad7c9c…Contract test failed: AssertionError [ERR_ASSERTION]: setting empty channel must throw ERR_UPDATER_INVALID_CHANNEL · at run (<path>:<n>:<n>) …node · unclassified-diagnostic · outer node · gap stage-unknown증거 품질: complete · 환경 변형: 1 · 최초 관측: 2026-08-30 · 마지막 관측: 2026-08-30진단 재검증 후보
-
관측됨 UNKNOWN exit 1 증거 공백 ×1 6.8.9 executionContext=node · moduleSystem=cjs · os=linux · runtime=node@22.23 electron-updater.AppUpdater sha256:1c03ca490615…Traceback (most recent call last): · File <str>, line 3, in <module> · AttributeError: module <str> has no attribute <str> · IANA_VERSION: <str>python · unclassified-diagnostic · outer python · gap stage-unknown증거 품질: complete · 환경 변형: 1 · 최초 관측: 2026-08-30 · 마지막 관측: 2026-08-30진단 재검증 후보
-
관측됨 UNKNOWN exit 1 증거 공백 ×1 6.8.9 executionContext=node · moduleSystem=cjs · os=linux · runtime=node@22.23 electron-updater.AppUpdater sha256:9be950af9140…Traceback (most recent call last): · File <str>, line 1, in <module> · ModuleNotFoundError: No module named <str>python3 · unclassified-diagnostic · outer python3 · gap stage-unknown증거 품질: complete · 환경 변형: 1 · 최초 관측: 2026-08-30 · 마지막 관측: 2026-08-30진단 재검증 후보
-
관측됨 UNKNOWN exit 1 증거 공백 ×1 6.8.9 executionContext=node · moduleSystem=cjs · os=linux · runtime=node@22.23 electron-updater.AppUpdater sha256:d296ed2b3573…Traceback (most recent call last): · File <str>, line 5, in <module> · ModuleNotFoundError: No module named <str> · IANA_VERSION: <str>python · unclassified-diagnostic · outer python · gap stage-unknown증거 품질: complete · 환경 변형: 1 · 최초 관측: 2026-08-30 · 마지막 관측: 2026-08-30진단 재검증 후보