记录npmelectron-updater6.8.9electron-updater.AppImageUpdater
更改条件
依赖健康度
此版本的依赖组合与失败观测
观测到问题 1 项 ·
变动 2 项 ·
正常 8 项
| 库 | 版本 | 健康状态 | 在那里测得 | 项目 |
|---|---|---|---|---|
| builder-util-runtime | 9.7.0 | CANDIDATE 相关变更;组合未证实 | 契约通过 | 14 个项目日 |
| semver | 7.7.4 | CANDIDATE 相关变更;组合未证实 | 契约通过 | 13 个项目日 |
| fs-extra | 10.1.0 | PASS 所有观测均通过 | 契约通过 | 14 个项目日 |
| js-yaml | 4.3.0 | PASS 所有观测均通过 | 契约通过 | 3 个项目日 |
| js-yaml | 4.3.1 | PASS 所有观测均通过 | 契约通过 | 11 个项目日 |
| js-yaml | 4.3.2 | PASS 所有观测均通过 | 契约通过 | 3 个项目日 |
| lazy-val | 1.0.5 | PASS 所有观测均通过 | 契约通过 | 14 个项目日 |
| lodash.escaperegexp | 4.1.2 | PASS 所有观测均通过 | 契约通过 | 14 个项目日 |
| lodash.isequal | 4.5.0 | PASS 所有观测均通过 | 契约通过 | 13 个项目日 |
| tiny-typed-emitter | 2.1.0 | PASS 所有观测均通过 | 契约通过 | 10 个项目日 |
测量列说的是每个依赖自身版本的情况,而不是这一对的情况。解析器把两个版本放在一起,并不证明它们能协同工作。
各版本的依赖版本
本包的每个版本把子依赖解析到了哪个版本。版本发生变动的子依赖排在最前:升级正是在那里改变了你脚下的东西。
发生变动:2 · 所有版本相同:6
一条边记录的是解析器在真实机器上把一个版本放在了另一个版本旁边。它并不主张两者能协同工作;那个问题由样本和契约回答,而不是由这里存在一行来回答。
近期失败聚类
-
已观测 UNKNOWN exit 1 证据缺口 ×3 6.8.9 executionContext=node · moduleSystem=cjs · os=linux · runtime=node@22.23 electron-updater.AppImageUpdater sha256:91ad26545eb1…node:internal/modules/cjs/loader:<n> · throw err; · ^ · Error: Cannot find module <str>node · unclassified-diagnostic · outer node · gap stage-unknown证据质量: complete · 环境变体: 1 · 首次记录: 2026-08-29 · 最近观测: 2026-08-30诊断复验候选
-
已观测 PROJECT_TEST exit 1 ERR_ASSERTION ×2 6.8.9 executionContext=node · moduleSystem=cjs · os=linux · runtime=node@22.23 sha256:45fc70285a65…Contract test failed: AssertionError [ERR_ASSERTION]: DOWNLOAD_PROGRESS event should have fired · false !== true · at main (<path>:<n>:<n>) { …javascript/test-runner · test-runner-diagnostic · outer npm test证据质量: complete · 环境变体: 1 · 首次记录: 2026-08-29 · 最近观测: 2026-08-29
-
已观测 UNKNOWN exit 1 ERR_MODULE_NOT_FOUND 证据缺口 ×1 6.8.9 executionContext=node · moduleSystem=cjs · os=linux · runtime=node@22.23 electron-updater.AppImageUpdater sha256:88af852f99a8…node:internal/modules/package_json_reader:<n> · throw new ERR_MODULE_NOT_FOUND(packageName, fileURLToPath(base), null); · ^ …node · unclassified-diagnostic · outer node · gap stage-unknown证据质量: complete · 环境变体: 1 · 首次记录: 2026-08-29 · 最近观测: 2026-08-29诊断复验候选
-
已观测 UNKNOWN exit 1 证据缺口 ×1 6.8.9 executionContext=node · moduleSystem=cjs · os=linux · runtime=node@22.23 electron-updater.AppImageUpdater sha256:9922ca80f240…go: <path> already existsgo · unclassified-diagnostic · outer go mod · gap stage-unknown证据质量: complete · 环境变体: 1 · 首次记录: 2026-08-29 · 最近观测: 2026-08-29诊断复验候选
-
已观测 UNKNOWN exit 1 证据缺口 ×1 6.8.9 executionContext=node · moduleSystem=cjs · os=linux · runtime=node@22.23 electron-updater.AppImageUpdater sha256:8310a83be884…node:internal/modules/cjs/loader:<n> · const err = new Error(message); · ^ · Error: Cannot find module <str>node · unclassified-diagnostic · outer node · gap stage-unknown证据质量: complete · 环境变体: 1 · 首次记录: 2026-08-29 · 最近观测: 2026-08-29诊断复验候选
-
已观测 UNKNOWN exit 1 证据缺口 ×1 6.8.9 executionContext=node · moduleSystem=cjs · os=linux · runtime=node@22.23 sha256:8e2ccedae0ba…Contract test failed: TypeError: this.doDownloadUpdate is not a function · at CustomBaseUpdater.downloadUpdate <path>:<n>:<n>) · at main (<path>:<n>:<n>) …node · unclassified-diagnostic · outer node · gap stage-unknown证据质量: complete · 环境变体: 1 · 首次记录: 2026-08-29 · 最近观测: 2026-08-29诊断复验候选
-
已观测 UNKNOWN exit 1 证据缺口 ×1 6.8.9 executionContext=node · moduleSystem=cjs · os=linux · runtime=node@22.23 sha256:91bb8f54cd90…Contract test failed: Error: Command node exited with code 2 · at CustomBaseUpdater.spawnSyncLog <path>:<n>:<n>) · at main (<path>:<n>:<n>) …node · unclassified-diagnostic · outer node · gap stage-unknown证据质量: complete · 环境变体: 1 · 首次记录: 2026-08-29 · 最近观测: 2026-08-29诊断复验候选
-
已观测 UNKNOWN exit 1 ERR_ASSERTION 证据缺口 ×1 6.8.9 executionContext=node · moduleSystem=cjs · os=linux · runtime=node@22.23 electron-updater.AppImageUpdater sha256:07e974cf28d4…Test failed: AssertionError [ERR_ASSERTION]: getFeedURL should return configured feed url · + actual - expected · + <str> · - <str>node · unclassified-diagnostic · outer node · gap stage-unknown证据质量: complete · 环境变体: 1 · 首次记录: 2026-08-30 · 最近观测: 2026-08-30诊断复验候选
-
已观测 UNKNOWN exit 1 ERR_ASSERTION 证据缺口 ×1 6.8.9 executionContext=node · moduleSystem=cjs · os=linux · runtime=node@22.23 sha256:092c90ad7c9c…Contract test failed: AssertionError [ERR_ASSERTION]: setting empty channel must throw ERR_UPDATER_INVALID_CHANNEL · at run (<path>:<n>:<n>) …node · unclassified-diagnostic · outer node · gap stage-unknown证据质量: complete · 环境变体: 1 · 首次记录: 2026-08-30 · 最近观测: 2026-08-30诊断复验候选
-
已观测 UNKNOWN exit 1 证据缺口 ×1 6.8.9 executionContext=node · moduleSystem=cjs · os=linux · runtime=node@22.23 electron-updater.AppImageUpdater sha256:1c03ca490615…Traceback (most recent call last): · File <str>, line 3, in <module> · AttributeError: module <str> has no attribute <str> · IANA_VERSION: <str>python · unclassified-diagnostic · outer python · gap stage-unknown证据质量: complete · 环境变体: 1 · 首次记录: 2026-08-30 · 最近观测: 2026-08-30诊断复验候选
-
已观测 UNKNOWN exit 1 证据缺口 ×1 6.8.9 executionContext=node · moduleSystem=cjs · os=linux · runtime=node@22.23 electron-updater.AppImageUpdater sha256:9be950af9140…Traceback (most recent call last): · File <str>, line 1, in <module> · ModuleNotFoundError: No module named <str>python3 · unclassified-diagnostic · outer python3 · gap stage-unknown证据质量: complete · 环境变体: 1 · 首次记录: 2026-08-30 · 最近观测: 2026-08-30诊断复验候选
-
已观测 UNKNOWN exit 1 证据缺口 ×1 6.8.9 executionContext=node · moduleSystem=cjs · os=linux · runtime=node@22.23 electron-updater.AppImageUpdater sha256:d296ed2b3573…Traceback (most recent call last): · File <str>, line 5, in <module> · ModuleNotFoundError: No module named <str> · IANA_VERSION: <str>python · unclassified-diagnostic · outer python · gap stage-unknown证据质量: complete · 环境变体: 1 · 首次记录: 2026-08-30 · 最近观测: 2026-08-30诊断复验候选