Relevésnpmelectron-updater6.8.9electron-updater.AppImageUpdater
Changer les conditions
Conditions actuelles
electron-updater.AppImageUpdater @6.8.9ubuntu glibc · x64 · node 22 · npm 10 · node
0 sur 9 ont réussi
Vérifié — ce réseau a exécuté un contrat à cette coordonnée.
il y a un échantillon ici et notre exécution à cette coordonnée a échoué
- Observations de projets
- 8 / 8
- Vérifications de contrat
- 0 / 9
- Pairs rapporteurs indépendants
- 2
- Dernier enregistrement
- 2026-08-30
Santé des dépendances
Combinaisons observées et preuves d'échec pour cette version
Premier échec observé
6.8.9
windows · node@24.13 · moduleSystem=esm · executionContext=node
32 FAIL
· stage: UNKNOWN
· fingerprint: sha256:9f91c975308128a0f4f23e33b9d5936b9c39535b5c01aa9245b8cdc4b0a37a10
| Bibliothèque | Version | Santé | Mesuré là-bas | Projets |
|---|---|---|---|---|
| builder-util-runtime | 9.7.0 | CANDIDATE Changement corrélé; combinaison non prouvée | contrat réussi | 14 jours-projet |
| semver | 7.7.4 | CANDIDATE Changement corrélé; combinaison non prouvée | contrat réussi | 13 jours-projet |
| fs-extra | 10.1.0 | PASS Toutes les observations ont réussi | contrat réussi | 14 jours-projet |
| js-yaml | 4.3.0 | PASS Toutes les observations ont réussi | contrat réussi | 3 jours-projet |
| js-yaml | 4.3.1 | PASS Toutes les observations ont réussi | contrat réussi | 11 jours-projet |
| js-yaml | 4.3.2 | PASS Toutes les observations ont réussi | contrat réussi | 3 jours-projet |
| lazy-val | 1.0.5 | PASS Toutes les observations ont réussi | contrat réussi | 14 jours-projet |
| lodash.escaperegexp | 4.1.2 | PASS Toutes les observations ont réussi | contrat réussi | 14 jours-projet |
| lodash.isequal | 4.5.0 | PASS Toutes les observations ont réussi | contrat réussi | 13 jours-projet |
| tiny-typed-emitter | 2.1.0 | PASS Toutes les observations ont réussi | contrat réussi | 10 jours-projet |
La colonne de mesure porte sur la version de chaque dépendance elle-même, pas sur la paire. Qu'un résolveur ait placé deux versions côte à côte ne prouve pas qu'elles fonctionnent ensemble.
Versions des dépendances au fil des versions
Ce vers quoi chaque version de ce paquet a résolu ses enfants. L'enfant dont la version a bougé vient en premier : c'est là qu'une mise à jour a changé quelque chose sous vos pieds.
| Bibliothèque | 6.8.9 | 6.3.9 |
|---|---|---|
| builder-util-runtime | 9.7.0 | 9.2.10 |
| semver | 7.7.4 | 7.8.5 |
| fs-extra | 10.1.0 | 10.1.0 |
| js-yaml | 4.3.2 | 4.3.2 |
| lazy-val | 1.0.5 | 1.0.5 |
| lodash.escaperegexp | 4.1.2 | 4.1.2 |
| lodash.isequal | 4.5.0 | 4.5.0 |
| tiny-typed-emitter | 2.1.0 | 2.1.0 |
Ont bougé : 2 · identiques à chaque version : 6
Une arête indique qu'un résolveur a placé une version à côté d'une autre sur une machine réelle. Ce n'est pas une affirmation qu'elles fonctionnent ensemble ; à cette question répondent les échantillons et les contrats, pas la présence d'une ligne.
Clusters d'échecs récents
-
observé UNKNOWN exit 1 Lacune de preuve ×3 6.8.9 executionContext=node · moduleSystem=cjs · os=linux · runtime=node@22.23 electron-updater.AppImageUpdater sha256:91ad26545eb1…node:internal/modules/cjs/loader:<n> · throw err; · ^ · Error: Cannot find module <str>node · unclassified-diagnostic · outer node · gap stage-unknownQualité de preuve: complete · Variantes d’environnement: 1 · Premier relevé: 2026-08-29 · Dernière observation: 2026-08-30Candidat à une revérification diagnostique
-
observé PROJECT_TEST exit 1 ERR_ASSERTION ×2 6.8.9 executionContext=node · moduleSystem=cjs · os=linux · runtime=node@22.23 sha256:45fc70285a65…Contract test failed: AssertionError [ERR_ASSERTION]: DOWNLOAD_PROGRESS event should have fired · false !== true · at main (<path>:<n>:<n>) { …javascript/test-runner · test-runner-diagnostic · outer npm testQualité de preuve: complete · Variantes d’environnement: 1 · Premier relevé: 2026-08-29 · Dernière observation: 2026-08-29
-
observé UNKNOWN exit 1 ERR_MODULE_NOT_FOUND Lacune de preuve ×1 6.8.9 executionContext=node · moduleSystem=cjs · os=linux · runtime=node@22.23 electron-updater.AppImageUpdater sha256:88af852f99a8…node:internal/modules/package_json_reader:<n> · throw new ERR_MODULE_NOT_FOUND(packageName, fileURLToPath(base), null); · ^ …node · unclassified-diagnostic · outer node · gap stage-unknownQualité de preuve: complete · Variantes d’environnement: 1 · Premier relevé: 2026-08-29 · Dernière observation: 2026-08-29Candidat à une revérification diagnostique
-
observé UNKNOWN exit 1 Lacune de preuve ×1 6.8.9 executionContext=node · moduleSystem=cjs · os=linux · runtime=node@22.23 electron-updater.AppImageUpdater sha256:9922ca80f240…go: <path> already existsgo · unclassified-diagnostic · outer go mod · gap stage-unknownQualité de preuve: complete · Variantes d’environnement: 1 · Premier relevé: 2026-08-29 · Dernière observation: 2026-08-29Candidat à une revérification diagnostique
-
observé UNKNOWN exit 1 Lacune de preuve ×1 6.8.9 executionContext=node · moduleSystem=cjs · os=linux · runtime=node@22.23 electron-updater.AppImageUpdater sha256:8310a83be884…node:internal/modules/cjs/loader:<n> · const err = new Error(message); · ^ · Error: Cannot find module <str>node · unclassified-diagnostic · outer node · gap stage-unknownQualité de preuve: complete · Variantes d’environnement: 1 · Premier relevé: 2026-08-29 · Dernière observation: 2026-08-29Candidat à une revérification diagnostique
-
observé UNKNOWN exit 1 Lacune de preuve ×1 6.8.9 executionContext=node · moduleSystem=cjs · os=linux · runtime=node@22.23 sha256:8e2ccedae0ba…Contract test failed: TypeError: this.doDownloadUpdate is not a function · at CustomBaseUpdater.downloadUpdate <path>:<n>:<n>) · at main (<path>:<n>:<n>) …node · unclassified-diagnostic · outer node · gap stage-unknownQualité de preuve: complete · Variantes d’environnement: 1 · Premier relevé: 2026-08-29 · Dernière observation: 2026-08-29Candidat à une revérification diagnostique
-
observé UNKNOWN exit 1 Lacune de preuve ×1 6.8.9 executionContext=node · moduleSystem=cjs · os=linux · runtime=node@22.23 sha256:91bb8f54cd90…Contract test failed: Error: Command node exited with code 2 · at CustomBaseUpdater.spawnSyncLog <path>:<n>:<n>) · at main (<path>:<n>:<n>) …node · unclassified-diagnostic · outer node · gap stage-unknownQualité de preuve: complete · Variantes d’environnement: 1 · Premier relevé: 2026-08-29 · Dernière observation: 2026-08-29Candidat à une revérification diagnostique
-
observé UNKNOWN exit 1 ERR_ASSERTION Lacune de preuve ×1 6.8.9 executionContext=node · moduleSystem=cjs · os=linux · runtime=node@22.23 electron-updater.AppImageUpdater sha256:07e974cf28d4…Test failed: AssertionError [ERR_ASSERTION]: getFeedURL should return configured feed url · + actual - expected · + <str> · - <str>node · unclassified-diagnostic · outer node · gap stage-unknownQualité de preuve: complete · Variantes d’environnement: 1 · Premier relevé: 2026-08-30 · Dernière observation: 2026-08-30Candidat à une revérification diagnostique
-
observé UNKNOWN exit 1 ERR_ASSERTION Lacune de preuve ×1 6.8.9 executionContext=node · moduleSystem=cjs · os=linux · runtime=node@22.23 sha256:092c90ad7c9c…Contract test failed: AssertionError [ERR_ASSERTION]: setting empty channel must throw ERR_UPDATER_INVALID_CHANNEL · at run (<path>:<n>:<n>) …node · unclassified-diagnostic · outer node · gap stage-unknownQualité de preuve: complete · Variantes d’environnement: 1 · Premier relevé: 2026-08-30 · Dernière observation: 2026-08-30Candidat à une revérification diagnostique
-
observé UNKNOWN exit 1 Lacune de preuve ×1 6.8.9 executionContext=node · moduleSystem=cjs · os=linux · runtime=node@22.23 electron-updater.AppImageUpdater sha256:1c03ca490615…Traceback (most recent call last): · File <str>, line 3, in <module> · AttributeError: module <str> has no attribute <str> · IANA_VERSION: <str>python · unclassified-diagnostic · outer python · gap stage-unknownQualité de preuve: complete · Variantes d’environnement: 1 · Premier relevé: 2026-08-30 · Dernière observation: 2026-08-30Candidat à une revérification diagnostique
-
observé UNKNOWN exit 1 Lacune de preuve ×1 6.8.9 executionContext=node · moduleSystem=cjs · os=linux · runtime=node@22.23 electron-updater.AppImageUpdater sha256:9be950af9140…Traceback (most recent call last): · File <str>, line 1, in <module> · ModuleNotFoundError: No module named <str>python3 · unclassified-diagnostic · outer python3 · gap stage-unknownQualité de preuve: complete · Variantes d’environnement: 1 · Premier relevé: 2026-08-30 · Dernière observation: 2026-08-30Candidat à une revérification diagnostique
-
observé UNKNOWN exit 1 Lacune de preuve ×1 6.8.9 executionContext=node · moduleSystem=cjs · os=linux · runtime=node@22.23 electron-updater.AppImageUpdater sha256:d296ed2b3573…Traceback (most recent call last): · File <str>, line 5, in <module> · ModuleNotFoundError: No module named <str> · IANA_VERSION: <str>python · unclassified-diagnostic · outer python · gap stage-unknownQualité de preuve: complete · Variantes d’environnement: 1 · Premier relevé: 2026-08-30 · Dernière observation: 2026-08-30Candidat à une revérification diagnostique