記録npmelectron-updater6.8.9electron-updater.AppImageUpdater
条件を変更
現在の条件
electron-updater.AppImageUpdater @6.8.9ubuntu glibc · x64 · node 22 · npm 10 · node
9 回中 0 回が成功
検証 — このネットワークがこの座標でコントラクトを実行しました。
サンプルあり — この座標で実行し、失敗した
- プロジェクト観測
- 8 / 8
- コントラクト検証
- 0 / 9
- 独立した報告ピア
- 2
- 最終記録
- 2026-08-30
開ける証拠
依存関係のヘルス
このリリースの依存関係の組み合わせと失敗観測
観測された問題 1件 ·
変更 2件 ·
正常 8件
| ライブラリ | バージョン | ヘルス | その座標で測定されたこと | プロジェクト |
|---|---|---|---|---|
| builder-util-runtime | 9.7.0 | CANDIDATE 相関変更; 組み合わせ未証明 | コントラクト合格 | プロジェクト日 14 件 |
| semver | 7.7.4 | CANDIDATE 相関変更; 組み合わせ未証明 | コントラクト合格 | プロジェクト日 13 件 |
| fs-extra | 10.1.0 | PASS すべての観測で成功 | コントラクト合格 | プロジェクト日 14 件 |
| js-yaml | 4.3.0 | PASS すべての観測で成功 | コントラクト合格 | プロジェクト日 3 件 |
| js-yaml | 4.3.1 | PASS すべての観測で成功 | コントラクト合格 | プロジェクト日 11 件 |
| js-yaml | 4.3.2 | PASS すべての観測で成功 | コントラクト合格 | プロジェクト日 3 件 |
| lazy-val | 1.0.5 | PASS すべての観測で成功 | コントラクト合格 | プロジェクト日 14 件 |
| lodash.escaperegexp | 4.1.2 | PASS すべての観測で成功 | コントラクト合格 | プロジェクト日 14 件 |
| lodash.isequal | 4.5.0 | PASS すべての観測で成功 | コントラクト合格 | プロジェクト日 13 件 |
| tiny-typed-emitter | 2.1.0 | PASS すべての観測で成功 | コントラクト合格 | プロジェクト日 10 件 |
測定列は各依存関係自身のリリースに関するもので、2つのリリースの組み合わせに関するものではありません。リゾルバが2つを並べたという事実は、両者が協調して動く証拠ではありません。
リリースごとの依存バージョン
このパッケージの各リリースが子をどのバージョンに解決したかです。バージョンが動いた子が先に並びます — アップグレードが足元で何かを変えた地点です。
変動: 2 · 全リリースで同一: 6
エッジは、実機でリゾルバがあるリリースを別のリリースの隣に置いたという記録です。両者が一緒に動くという主張ではありません。その問いに答えるのは、ここに行があることではなくサンプルと契約です。
最近の失敗クラスター
-
観測済み UNKNOWN exit 1 証拠の欠落 ×3 6.8.9 executionContext=node · moduleSystem=cjs · os=linux · runtime=node@22.23 electron-updater.AppImageUpdater sha256:91ad26545eb1…node:internal/modules/cjs/loader:<n> · throw err; · ^ · Error: Cannot find module <str>node · unclassified-diagnostic · outer node · gap stage-unknown証拠品質: complete · 環境バリアント: 1 · 初回記録: 2026-08-29 · 最終観測: 2026-08-30診断再検証候補
-
観測済み PROJECT_TEST exit 1 ERR_ASSERTION ×2 6.8.9 executionContext=node · moduleSystem=cjs · os=linux · runtime=node@22.23 sha256:45fc70285a65…Contract test failed: AssertionError [ERR_ASSERTION]: DOWNLOAD_PROGRESS event should have fired · false !== true · at main (<path>:<n>:<n>) { …javascript/test-runner · test-runner-diagnostic · outer npm test証拠品質: complete · 環境バリアント: 1 · 初回記録: 2026-08-29 · 最終観測: 2026-08-29
-
観測済み UNKNOWN exit 1 ERR_MODULE_NOT_FOUND 証拠の欠落 ×1 6.8.9 executionContext=node · moduleSystem=cjs · os=linux · runtime=node@22.23 electron-updater.AppImageUpdater sha256:88af852f99a8…node:internal/modules/package_json_reader:<n> · throw new ERR_MODULE_NOT_FOUND(packageName, fileURLToPath(base), null); · ^ …node · unclassified-diagnostic · outer node · gap stage-unknown証拠品質: complete · 環境バリアント: 1 · 初回記録: 2026-08-29 · 最終観測: 2026-08-29診断再検証候補
-
観測済み UNKNOWN exit 1 証拠の欠落 ×1 6.8.9 executionContext=node · moduleSystem=cjs · os=linux · runtime=node@22.23 electron-updater.AppImageUpdater sha256:9922ca80f240…go: <path> already existsgo · unclassified-diagnostic · outer go mod · gap stage-unknown証拠品質: complete · 環境バリアント: 1 · 初回記録: 2026-08-29 · 最終観測: 2026-08-29診断再検証候補
-
観測済み UNKNOWN exit 1 証拠の欠落 ×1 6.8.9 executionContext=node · moduleSystem=cjs · os=linux · runtime=node@22.23 electron-updater.AppImageUpdater sha256:8310a83be884…node:internal/modules/cjs/loader:<n> · const err = new Error(message); · ^ · Error: Cannot find module <str>node · unclassified-diagnostic · outer node · gap stage-unknown証拠品質: complete · 環境バリアント: 1 · 初回記録: 2026-08-29 · 最終観測: 2026-08-29診断再検証候補
-
観測済み UNKNOWN exit 1 証拠の欠落 ×1 6.8.9 executionContext=node · moduleSystem=cjs · os=linux · runtime=node@22.23 sha256:8e2ccedae0ba…Contract test failed: TypeError: this.doDownloadUpdate is not a function · at CustomBaseUpdater.downloadUpdate <path>:<n>:<n>) · at main (<path>:<n>:<n>) …node · unclassified-diagnostic · outer node · gap stage-unknown証拠品質: complete · 環境バリアント: 1 · 初回記録: 2026-08-29 · 最終観測: 2026-08-29診断再検証候補
-
観測済み UNKNOWN exit 1 証拠の欠落 ×1 6.8.9 executionContext=node · moduleSystem=cjs · os=linux · runtime=node@22.23 sha256:91bb8f54cd90…Contract test failed: Error: Command node exited with code 2 · at CustomBaseUpdater.spawnSyncLog <path>:<n>:<n>) · at main (<path>:<n>:<n>) …node · unclassified-diagnostic · outer node · gap stage-unknown証拠品質: complete · 環境バリアント: 1 · 初回記録: 2026-08-29 · 最終観測: 2026-08-29診断再検証候補
-
観測済み UNKNOWN exit 1 ERR_ASSERTION 証拠の欠落 ×1 6.8.9 executionContext=node · moduleSystem=cjs · os=linux · runtime=node@22.23 electron-updater.AppImageUpdater sha256:07e974cf28d4…Test failed: AssertionError [ERR_ASSERTION]: getFeedURL should return configured feed url · + actual - expected · + <str> · - <str>node · unclassified-diagnostic · outer node · gap stage-unknown証拠品質: complete · 環境バリアント: 1 · 初回記録: 2026-08-30 · 最終観測: 2026-08-30診断再検証候補
-
観測済み UNKNOWN exit 1 ERR_ASSERTION 証拠の欠落 ×1 6.8.9 executionContext=node · moduleSystem=cjs · os=linux · runtime=node@22.23 sha256:092c90ad7c9c…Contract test failed: AssertionError [ERR_ASSERTION]: setting empty channel must throw ERR_UPDATER_INVALID_CHANNEL · at run (<path>:<n>:<n>) …node · unclassified-diagnostic · outer node · gap stage-unknown証拠品質: complete · 環境バリアント: 1 · 初回記録: 2026-08-30 · 最終観測: 2026-08-30診断再検証候補
-
観測済み UNKNOWN exit 1 証拠の欠落 ×1 6.8.9 executionContext=node · moduleSystem=cjs · os=linux · runtime=node@22.23 electron-updater.AppImageUpdater sha256:1c03ca490615…Traceback (most recent call last): · File <str>, line 3, in <module> · AttributeError: module <str> has no attribute <str> · IANA_VERSION: <str>python · unclassified-diagnostic · outer python · gap stage-unknown証拠品質: complete · 環境バリアント: 1 · 初回記録: 2026-08-30 · 最終観測: 2026-08-30診断再検証候補
-
観測済み UNKNOWN exit 1 証拠の欠落 ×1 6.8.9 executionContext=node · moduleSystem=cjs · os=linux · runtime=node@22.23 electron-updater.AppImageUpdater sha256:9be950af9140…Traceback (most recent call last): · File <str>, line 1, in <module> · ModuleNotFoundError: No module named <str>python3 · unclassified-diagnostic · outer python3 · gap stage-unknown証拠品質: complete · 環境バリアント: 1 · 初回記録: 2026-08-30 · 最終観測: 2026-08-30診断再検証候補
-
観測済み UNKNOWN exit 1 証拠の欠落 ×1 6.8.9 executionContext=node · moduleSystem=cjs · os=linux · runtime=node@22.23 electron-updater.AppImageUpdater sha256:d296ed2b3573…Traceback (most recent call last): · File <str>, line 5, in <module> · ModuleNotFoundError: No module named <str> · IANA_VERSION: <str>python · unclassified-diagnostic · outer python · gap stage-unknown証拠品質: complete · 環境バリアント: 1 · 初回記録: 2026-08-30 · 最終観測: 2026-08-30診断再検証候補