Recordsnpmelectron-to-chromium1.5.422
Environment detail
Project-level observations and symbol/contract verifications are counted separately and never combined.
These counts do not distinguish how the symbol was called: overloads, argument shapes and options are pooled together. What a particular call shape does is proven by a sample's contract, not by these numbers.
| Environment | Confidence | Observations | Verified | Pass rate | Peers | Last seen |
|---|---|---|---|---|---|---|
| node 22.23 · JS · npm · linux glibc
Observations: PROJECT_PROCESS 89✓ · PROJECT_RESOLVE 0✓ 1✕ · PROJECT_TEST 3✓ — Usage: USED 30✓ — Verified: PROCESS_START 0✓ 1✕ · UNKNOWN 0✓ 8✕
|
HIGH | 93 +30 | 9 | 90% | 3 | 2026-09-14 |
| node 22.23 · JS · npm · linux glibc
Observations: PROJECT_PROCESS 43✓ · PROJECT_TEST 6✓ — Usage: USED 5✓ — Verified: UNKNOWN 0✓ 3✕
|
MEDIUM | 49 +5 | 3 | 94% | 2 | 2026-09-07 |
Recent failure clusters
-
observed UNKNOWN exit 1 Evidence gap ×8 1.5.412 → 1.5.415 → 1.5.420 → 1.5.422 executionContext=node · moduleSystem=cjs · os=linux · runtime=node@22.23 sha256:91ad26545eb1…node:internal/modules/cjs/loader:<n> · throw err; · ^ · Error: Cannot find module <str>node · unclassified-diagnostic · outer node · gap stage-unknownEvidence quality: complete · Environment variants: 1 · First recorded: 2026-08-30 · Last seen: 2026-09-05Diagnostic re-verification candidate
-
observed UNKNOWN exit 1 ERR_MODULE_NOT_FOUND Evidence gap ×7 1.5.415 → 1.5.420 → 1.5.422 executionContext=node · os=linux · runtime=node@22.23 sha256:88af852f99a8…node:internal/modules/package_json_reader:<n> · throw new ERR_MODULE_NOT_FOUND(packageName, fileURLToPath(base), null); · ^ …node · unclassified-diagnostic · outer node · gap stage-unknownEvidence quality: complete · Environment variants: 2 · First recorded: 2026-08-30 · Last seen: 2026-09-05Diagnostic re-verification candidate
-
observed UNKNOWN exit 1 ERR_ASSERTION Evidence gap ×6 1.5.403 → 1.5.412 → 1.5.415 → 1.5.420 → 1.5.422 executionContext=node · os=linux · runtime=node@22.23 sha256:986d98189e70…node:internal/modules/run_main:<n> · triggerUncaughtException( · ^ · AssertionError [ERR_ASSERTION]: Expected values to be strictly equal:node · unclassified-diagnostic · outer node · gap stage-unknownEvidence quality: complete · Environment variants: 2 · First recorded: 2026-08-30 · Last seen: 2026-09-04Diagnostic re-verification candidate
-
observed PROCESS_START process start failed Evidence gap ×4 1.5.403 → 1.5.412 → 1.5.422 executionContext=node sha256:c12549970456…· structured-termination · gap diagnostic-missingEvidence quality: partial · Environment variants: 2 · First recorded: 2026-08-31 · Last seen: 2026-09-16Diagnostic re-verification candidate
-
observed UNKNOWN exit 1 Evidence gap ×2 1.5.420 → 1.5.422 executionContext=node · moduleSystem=esm · os=linux · runtime=node@22.23 sha256:455451e1a14e…<url>]:<n> · import babel from <str>; · ^^^^^ · SyntaxError: The requested module <str> does not provide an export named <str>node · unclassified-diagnostic · outer node · gap stage-unknownEvidence quality: complete · Environment variants: 1 · First recorded: 2026-09-02 · Last seen: 2026-09-05Diagnostic re-verification candidate
-
observed UNKNOWN exit 1 ERROR Evidence gap ×1 1.5.422 executionContext=node · moduleSystem=cjs · os=linux · runtime=node@22.23 sha256:1f882fb2e944…✘ [ERROR] Could not resolve <str> · failed to load config from <path> · <path>:<n> · let error = new Error(text);node · unclassified-diagnostic · outer node · gap stage-unknownEvidence quality: complete · Environment variants: 1 · First recorded: 2026-09-04 · Last seen: 2026-09-04Diagnostic re-verification candidate
-
observed UNKNOWN exit 1 ERR_PACKAGE_PATH_NOT_EXPORTED Evidence gap ×1 1.5.422 executionContext=node · moduleSystem=cjs · os=linux · runtime=node@22.23 sha256:e72340c7e3d4…node:internal/modules/cjs/loader:<n> · throw e; · ^ · Error [ERR_PACKAGE_PATH_NOT_EXPORTED]: Package subpath <str> is not defined by <str> in <path>node · unclassified-diagnostic · outer node · gap stage-unknownEvidence quality: complete · Environment variants: 1 · First recorded: 2026-09-04 · Last seen: 2026-09-04Diagnostic re-verification candidate
-
observed PROJECT_RESOLVE exit 1 ×1 1.5.422 executionContext=node · moduleSystem=cjs · os=linux · runtime=node@22.23 sha256:15e1b71df43a…test_contract.go:<n>:<n>: no required module provides package golang.org/x/text/unicode/norm: go.mod file not found in current directory or any parent …go/module · resolve-diagnostic · outer go runEvidence quality: complete · Environment variants: 1 · First recorded: 2026-09-05 · Last seen: 2026-09-05
-
observed UNKNOWN exit 1 Evidence gap ×1 1.5.422 executionContext=node · moduleSystem=esm · os=linux · runtime=node@22.23 sha256:036052acb454…[eval]:<n> · const inst1 = plugin(api, { method: <str>, include: [<str>, <str>] }); · ^ · TypeError: plugin is not a functionnode · unclassified-diagnostic · outer node · gap stage-unknownEvidence quality: complete · Environment variants: 1 · First recorded: 2026-09-05 · Last seen: 2026-09-05Diagnostic re-verification candidate
-
observed UNKNOWN exit 1 Evidence gap ×1 1.5.422 executionContext=node · moduleSystem=cjs · os=linux · runtime=node@22.23 sha256:138a106a5937…stat main.go: no such file or directorygo · unclassified-diagnostic · outer go run · gap stage-unknownEvidence quality: complete · Environment variants: 1 · First recorded: 2026-09-05 · Last seen: 2026-09-05Diagnostic re-verification candidate
-
observed UNKNOWN exit 1 Evidence gap ×1 1.5.422 executionContext=node · moduleSystem=cjs · os=linux · runtime=node@22.23 sha256:69ab38336834…assertion 1 failed: expected text/plain; version=0.0.4; charset=utf-8, got text/plain; version=0.0.4; charset=utf-8; escaping=underscores · exit status 1go · unclassified-diagnostic · outer go run · gap stage-unknownEvidence quality: complete · Environment variants: 1 · First recorded: 2026-09-05 · Last seen: 2026-09-05Diagnostic re-verification candidate
-
observed UNKNOWN exit 1 ERR_ASSERTION Evidence gap ×1 1.5.422 executionContext=node · moduleSystem=cjs · os=linux · runtime=node@22.23 sha256:761ce8fa9777…node:assert:<n> · throw new AssertionError(obj); · ^ · AssertionError [ERR_ASSERTION]: Should yield 4 tokens for const answer = 42;node · unclassified-diagnostic · outer node · gap stage-unknownEvidence quality: complete · Environment variants: 1 · First recorded: 2026-09-05 · Last seen: 2026-09-05Diagnostic re-verification candidate
Showing the 12 most-reported of 13 recorded failure clusters. The rest are single reports.
Symbols
No symbols with evidence yet.