記録npmdefine-properties1.2.1
条件を変更
現在の条件
define-properties @1.2.1debian glibc · x64 · node 22 · npm · node
API ではなくパッケージ全体の合計
プロジェクトに存在した記録のみです。この座標で実行されたものはありません。
観測 — 実際のプロジェクトのビルドがこの座標から報告されました。
サンプルあり — この座標ではまだ実行していない (3)
- プロジェクト観測
- この座標にはなし
- コントラクト検証
- この座標にはなし
- 使用記録
- 7
- 独立した報告ピア
- 1
- 最終記録
- 2026-09-14
開ける証拠
依存関係のヘルス
このリリースの依存関係の組み合わせと失敗観測
観測された問題 1件 ·
正常 3件
| ライブラリ | バージョン | ヘルス | その座標で測定されたこと | プロジェクト |
|---|---|---|---|---|
| define-data-property | 1.1.4 | PASS すべての観測で成功 | コントラクト合格 | プロジェクト日 44 件 |
| has-property-descriptors | 1.0.2 | PASS すべての観測で成功 | コントラクト合格 | プロジェクト日 44 件 |
| object-keys | 1.1.1 | PASS すべての観測で成功 | コントラクト合格 | プロジェクト日 42 件 |
測定列は各依存関係自身のリリースに関するもので、2つのリリースの組み合わせに関するものではありません。リゾルバが2つを並べたという事実は、両者が協調して動く証拠ではありません。
最近の失敗クラスター
-
観測済み UNKNOWN exit 1 証拠の欠落 ×15 1.2.1 executionContext=node · moduleSystem=cjs · os=linux · runtime=node@22.23 sha256:9be950af9140…Traceback (most recent call last): · File <str>, line 1, in <module> · ModuleNotFoundError: No module named <str>python3 · unclassified-diagnostic · outer python3 · gap stage-unknown証拠品質: complete · 環境バリアント: 1 · 初回記録: 2026-08-29 · 最終観測: 2026-08-31診断再検証候補
-
観測済み PROCESS_START process start failed 証拠の欠落 ×6 1.2.1 executionContext=node sha256:c12549970456…· structured-termination · gap diagnostic-missing証拠品質: partial · 環境バリアント: 2 · 初回記録: 2026-08-31 · 最終観測: 2026-09-16診断再検証候補
-
観測済み PROJECT_PROCESS 証拠の欠落 ×4 1.2.1 executionContext=node · moduleSystem=cjs · os=linux · runtime=node@22.23証拠品質: legacy-evidence-incomplete · 環境バリアント: 1 · 初回記録: 2026-08-27 · 最終観測: 2026-08-27診断再検証候補
-
観測済み UNKNOWN exit 2 証拠の欠落 ×4 1.2.1 executionContext=node · moduleSystem=cjs · os=linux · runtime=node@22.23 sha256:fddf8ea09045…Using CPython 3.12.3 interpreter at: <path> · Creating virtual environment at: .venv · error: Failed to create virtual environment …· unclassified-diagnostic · gap stage-unknown証拠品質: complete · 環境バリアント: 1 · 初回記録: 2026-08-29 · 最終観測: 2026-08-31診断再検証候補
-
観測済み UNKNOWN exit 1 証拠の欠落 ×4 1.2.1 executionContext=node · moduleSystem=cjs · os=linux · runtime=node@22.23 sha256:72ba2d1e946f…<path>: No module named pippython3 · unclassified-diagnostic · outer python3 · gap stage-unknown証拠品質: complete · 環境バリアント: 1 · 初回記録: 2026-08-31 · 最終観測: 2026-08-31診断再検証候補
-
観測済み UNKNOWN exit 1 ERR_MODULE_NOT_FOUND 証拠の欠落 ×2 1.2.1 executionContext=node · moduleSystem=esm · os=linux · runtime=node@22.23 sha256:a4c16095efc0…node:internal/modules/run_main:<n> · triggerUncaughtException( · ^ · Error [ERR_MODULE_NOT_FOUND]: Cannot find module <str> imported from <path>node · unclassified-diagnostic · outer node · gap stage-unknown証拠品質: complete · 環境バリアント: 1 · 初回記録: 2026-09-03 · 最終観測: 2026-09-05診断再検証候補
-
観測済み UNKNOWN exit 1 証拠の欠落 ×1 1.2.1 executionContext=node · moduleSystem=cjs · os=linux · runtime=node@22.23 sha256:6370f8688b49…Contract test failed: Error: Cannot find module <str> · Require stack: · - <path> · - <path>node · unclassified-diagnostic · outer node · gap stage-unknown証拠品質: complete · 環境バリアント: 1 · 初回記録: 2026-08-29 · 最終観測: 2026-08-29診断再検証候補
-
観測済み UNKNOWN exit 1 ERR_ASSERTION 証拠の欠落 ×1 1.2.1 executionContext=node · moduleSystem=cjs · os=linux · runtime=node@22.23 sha256:f326878dcad5…AssertionError [ERR_ASSERTION]: App declaration must contain <str> method · at runTests (<path>:<n>:<n>) · at Object.<anonymous> (<path>:<n>:<n>) …node · unclassified-diagnostic · outer node · gap stage-unknown証拠品質: complete · 環境バリアント: 1 · 初回記録: 2026-08-29 · 最終観測: 2026-08-29診断再検証候補
-
観測済み UNKNOWN exit 1 証拠の欠落 ×1 1.2.1 executionContext=node · moduleSystem=cjs · os=linux · runtime=node@22.23 sha256:aff813d6d5e0…go: go.mod file not found in current directory or any parent directory; see <str>go · unclassified-diagnostic · outer go run · gap stage-unknown証拠品質: complete · 環境バリアント: 1 · 初回記録: 2026-08-29 · 最終観測: 2026-08-29診断再検証候補
-
観測済み UNKNOWN exit 1 ERR_ASSERTION 証拠の欠落 ×1 1.2.1 executionContext=node · moduleSystem=cjs · os=linux · runtime=node@22.23 sha256:0d62cac8c07a…AssertionError [ERR_ASSERTION]: Expected values to be strictly equal: · + actual - expected · + <str> · - <str>node · unclassified-diagnostic · outer node · gap stage-unknown証拠品質: complete · 環境バリアント: 1 · 初回記録: 2026-08-30 · 最終観測: 2026-08-30診断再検証候補
-
観測済み UNKNOWN exit 1 証拠の欠落 ×1 1.2.1 executionContext=node · moduleSystem=cjs · os=linux · runtime=node@22.23 sha256:e1d65fc7c136…<path>:<n> · throw new Error(`Unsupported arch ${name}`) · ^ · Error: Unsupported arch 1node · unclassified-diagnostic · outer node · gap stage-unknown証拠品質: complete · 環境バリアント: 1 · 初回記録: 2026-08-30 · 最終観測: 2026-08-30診断再検証候補
-
観測済み UNKNOWN exit 1 証拠の欠落 ×1 1.2.1 executionContext=node · moduleSystem=cjs · os=linux · runtime=node@22.23 sha256:5223002d6c48…<path>:<n> · defineProperty(object, props[i], map[props[i]], predicates[props[i]]); · ^ · TypeError: Cannot read properties of undefined (reading <str>)node · unclassified-diagnostic · outer node · gap stage-unknown証拠品質: complete · 環境バリアント: 1 · 初回記録: 2026-08-30 · 最終観測: 2026-08-30診断再検証候補
最も多く報告された 12 件を表示しています。この座標に記録された失敗クラスタは 31 件です。残りは単発の報告です。