Aufzeichnungennpmdefine-data-property1.1.4
Bedingungen ändern
Aktuelle Bedingungen
define-data-property @1.1.4ubuntu glibc · x64 · node 22 · npm 10 · node
Paketsumme, keine API
0 von 49 bestanden
Verifiziert — dieses Netzwerk hat an dieser Koordinate einen Contract ausgeführt.
hier gibt es ein Sample, und unser Lauf an dieser Koordinate ist fehlgeschlagen (1)
- Projektbeobachtungen
- 64 / 68
- Contract-Verifikationen
- 0 / 49
- Nutzungsdatensätze
- 88
- Unabhängig meldende Peers
- 3
- Fehlschläge mit erfasstem Fingerabdruck
- 0 / 4
- Zuletzt erfasst
- 2026-09-14
Abhängigkeits-Zustand
Beobachtete Kombinationen und Fehlernachweise für dieses Release
Erster beobachteter Fehler
1.1.4
windows · node@24.13 · executionContext=node · moduleSystem=esm
31 FAIL
· stage: UNKNOWN
· fingerprint: sha256:9f91c975308128a0f4f23e33b9d5936b9c39535b5c01aa9245b8cdc4b0a37a10
| Bibliothek | Version | Zustand | Dort gemessen | Projekte |
|---|---|---|---|---|
| es-define-property | 1.0.1 | PASS Alle Beobachtungen bestanden | Contract bestanden | 42 Projekttage |
| es-errors | 1.3.0 | PASS Alle Beobachtungen bestanden | Contract bestanden | 42 Projekttage |
| gopd | 1.2.0 | PASS Alle Beobachtungen bestanden | Contract bestanden | 42 Projekttage |
Die Messspalte betrifft das Release der jeweiligen Abhängigkeit selbst, nicht das Paar. Dass ein Resolver zwei Releases nebeneinandergestellt hat, ist kein Beleg dafür, dass sie zusammen funktionieren.
Aktuelle Fehler-Cluster
-
beobachtet UNKNOWN exit 1 Beweislücke ×12 1.1.4 executionContext=node · moduleSystem=cjs · os=linux · runtime=node@22.23 sha256:9be950af9140…Traceback (most recent call last): · File <str>, line 1, in <module> · ModuleNotFoundError: No module named <str>python3 · unclassified-diagnostic · outer python3 · gap stage-unknownBeweisqualität: complete · Umgebungsvarianten: 1 · Zuerst erfasst: 2026-08-31 · Zuletzt gesehen: 2026-08-31Kandidat für diagnostische Neuprüfung
-
beobachtet PROCESS_START process start failed Beweislücke ×6 1.1.4 executionContext=node sha256:c12549970456…· structured-termination · gap diagnostic-missingBeweisqualität: partial · Umgebungsvarianten: 2 · Zuerst erfasst: 2026-08-31 · Zuletzt gesehen: 2026-09-16Kandidat für diagnostische Neuprüfung
-
beobachtet PROJECT_PROCESS Beweislücke ×4 1.1.4 executionContext=node · moduleSystem=cjs · os=linux · runtime=node@22.23Beweisqualität: legacy-evidence-incomplete · Umgebungsvarianten: 1 · Zuerst erfasst: 2026-08-29 · Zuletzt gesehen: 2026-08-29Kandidat für diagnostische Neuprüfung
-
beobachtet UNKNOWN exit 1 Beweislücke ×4 1.1.4 executionContext=node · moduleSystem=cjs · os=linux · runtime=node@22.23 sha256:72ba2d1e946f…<path>: No module named pippython3 · unclassified-diagnostic · outer python3 · gap stage-unknownBeweisqualität: complete · Umgebungsvarianten: 1 · Zuerst erfasst: 2026-08-31 · Zuletzt gesehen: 2026-08-31Kandidat für diagnostische Neuprüfung
-
beobachtet UNKNOWN exit 2 Beweislücke ×3 1.1.4 executionContext=node · moduleSystem=cjs · os=linux · runtime=node@22.23 sha256:fddf8ea09045…Using CPython 3.12.3 interpreter at: <path> · Creating virtual environment at: .venv · error: Failed to create virtual environment …· unclassified-diagnostic · gap stage-unknownBeweisqualität: complete · Umgebungsvarianten: 1 · Zuerst erfasst: 2026-08-31 · Zuletzt gesehen: 2026-08-31Kandidat für diagnostische Neuprüfung
-
beobachtet UNKNOWN exit 1 ERR_MODULE_NOT_FOUND Beweislücke ×2 1.1.4 executionContext=node · moduleSystem=esm · os=linux · runtime=node@22.23 sha256:a4c16095efc0…node:internal/modules/run_main:<n> · triggerUncaughtException( · ^ · Error [ERR_MODULE_NOT_FOUND]: Cannot find module <str> imported from <path>node · unclassified-diagnostic · outer node · gap stage-unknownBeweisqualität: complete · Umgebungsvarianten: 1 · Zuerst erfasst: 2026-09-03 · Zuletzt gesehen: 2026-09-05Kandidat für diagnostische Neuprüfung
-
beobachtet UNKNOWN exit 1 Beweislücke ×1 1.1.4 executionContext=node · moduleSystem=cjs · os=linux · runtime=node@22.23 sha256:6370f8688b49…Contract test failed: Error: Cannot find module <str> · Require stack: · - <path> · - <path>node · unclassified-diagnostic · outer node · gap stage-unknownBeweisqualität: complete · Umgebungsvarianten: 1 · Zuerst erfasst: 2026-08-29 · Zuletzt gesehen: 2026-08-29Kandidat für diagnostische Neuprüfung
-
beobachtet UNKNOWN exit 1 ERR_ASSERTION Beweislücke ×1 1.1.4 executionContext=node · moduleSystem=cjs · os=linux · runtime=node@22.23 sha256:f326878dcad5…AssertionError [ERR_ASSERTION]: App declaration must contain <str> method · at runTests (<path>:<n>:<n>) · at Object.<anonymous> (<path>:<n>:<n>) …node · unclassified-diagnostic · outer node · gap stage-unknownBeweisqualität: complete · Umgebungsvarianten: 1 · Zuerst erfasst: 2026-08-29 · Zuletzt gesehen: 2026-08-29Kandidat für diagnostische Neuprüfung
-
beobachtet UNKNOWN exit 1 ERR_ASSERTION Beweislücke ×1 1.1.4 executionContext=node · moduleSystem=cjs · os=linux · runtime=node@22.23 sha256:0d62cac8c07a…AssertionError [ERR_ASSERTION]: Expected values to be strictly equal: · + actual - expected · + <str> · - <str>node · unclassified-diagnostic · outer node · gap stage-unknownBeweisqualität: complete · Umgebungsvarianten: 1 · Zuerst erfasst: 2026-08-30 · Zuletzt gesehen: 2026-08-30Kandidat für diagnostische Neuprüfung
-
beobachtet UNKNOWN exit 1 Beweislücke ×1 1.1.4 executionContext=node · moduleSystem=cjs · os=linux · runtime=node@22.23 sha256:e1d65fc7c136…<path>:<n> · throw new Error(`Unsupported arch ${name}`) · ^ · Error: Unsupported arch 1node · unclassified-diagnostic · outer node · gap stage-unknownBeweisqualität: complete · Umgebungsvarianten: 1 · Zuerst erfasst: 2026-08-30 · Zuletzt gesehen: 2026-08-30Kandidat für diagnostische Neuprüfung
-
beobachtet UNKNOWN exit 1 Beweislücke ×1 1.1.4 executionContext=node · moduleSystem=cjs · os=linux · runtime=node@22.23 sha256:5223002d6c48…<path>:<n> · defineProperty(object, props[i], map[props[i]], predicates[props[i]]); · ^ · TypeError: Cannot read properties of undefined (reading <str>)node · unclassified-diagnostic · outer node · gap stage-unknownBeweisqualität: complete · Umgebungsvarianten: 1 · Zuerst erfasst: 2026-08-30 · Zuletzt gesehen: 2026-08-30Kandidat für diagnostische Neuprüfung
-
beobachtet UNKNOWN exit 1 ERR_ASSERTION Beweislücke ×1 1.1.4 executionContext=node · moduleSystem=cjs · os=linux · runtime=node@22.23 sha256:509afba8c7b2…node:assert:<n> · throw err; · ^ · AssertionError [ERR_ASSERTION]: The input did not match the regular expression <path> image path cannot be empty/. Input:node · unclassified-diagnostic · outer node · gap stage-unknownBeweisqualität: complete · Umgebungsvarianten: 1 · Zuerst erfasst: 2026-08-30 · Zuletzt gesehen: 2026-08-30Kandidat für diagnostische Neuprüfung
Es werden die 12 meistgemeldeten von 30 aufgezeichneten Fehlerclustern gezeigt. Der Rest sind Einzelmeldungen.