Записиnpmdebug4.4.3
Изменить условия
Текущие условия
debug @4.4.3windows 11 · x64 · node 24 · pnpm 10 · node
итог по пакету, а не API
0 из 229 прошли
Проверено — эта сеть выполнила контракт в этой координате.
образец есть — наш запуск в этой координате не прошёл (1)
- Наблюдения в проектах
- 326 / 424
- Проверки контрактом
- 0 / 229
- Записи об использовании
- 1 256
- Независимые сообщившие пиры
- 1
- Сбои с собранным отпечатком
- 95 / 98
- Последняя запись
- 2026-09-26
Здоровье зависимостей
Наблюдаемые комбинации и свидетельства сбоев для этого выпуска
Первый обнаруженный сбой
4.4.3
executionContext=node
60 FAIL · stage: PROJECT_PROCESS
| Библиотека | Версия | Состояние | Измерено там | Проектов |
|---|---|---|---|---|
| ms | 2.1.3 | CANDIDATE Коррелированное изменение; комбинация не подтверждена | контракт пройден | 434 проектных дня |
Столбец измерения относится к релизу самой зависимости, а не к паре. То, что резолвер поставил два релиза рядом, не доказывает, что они работают вместе.
Версии зависимостей по выпускам
К чему каждый выпуск этого пакета разрешил своих потомков. Потомок, чья версия сдвинулась, идёт первым: там обновление изменило что-то под вами.
Сдвинулось: 1 · одинаково во всех выпусках: 0
Ребро фиксирует, что резолвер поставил один релиз рядом с другим на реальной машине. Это не утверждение, что они работают вместе; на этот вопрос отвечают образцы и контракты, а не наличие строки.
Недавние кластеры сбоев
-
наблюдалось PROJECT_PROCESS ERR_ASSERTION Пробел в данных ×60 2.6.9 → 4.3.7 → 4.4.3 executionContext=nodeКачество данных: legacy-evidence-incomplete · Варианты среды: 3 · Первая запись: 2026-08-13 · Последнее наблюдение: 2026-08-30Кандидат на диагностическую перепроверку
-
наблюдалось PROCESS_START process start failed Пробел в данных ×51 2.6.9 → 4.4.3 executionContext=node sha256:c12549970456…· structured-termination · gap diagnostic-missingКачество данных: partial · Варианты среды: 4 · Первая запись: 2026-08-29 · Последнее наблюдение: 2026-09-16Кандидат на диагностическую перепроверку
-
наблюдалось UNKNOWN exit 1 ERR_PNPM_RECURSIVE_RUN_FIRST_FAIL Пробел в данных ×32 4.4.3 executionContext=node · moduleSystem=esm · os=windows · runtime=node@24.13 sha256:9f91c9753081…(node:<n>) ExperimentalWarning: SQLite is an experimental feature and might change at any time …pnpm · unclassified-diagnostic · outer pnpm · gap stage-unknownКачество данных: complete · Варианты среды: 1 · Первая запись: 2026-09-01 · Последнее наблюдение: 2026-09-17Кандидат на диагностическую перепроверку
-
наблюдалось UNKNOWN exit 1 ERR_PNPM_RECURSIVE_EXEC_FIRST_FAIL Пробел в данных ×28 4.4.3 executionContext=node · moduleSystem=esm · os=windows · runtime=node@24.13 sha256:979755e6489d…(node:<n>) ExperimentalWarning: SQLite is an experimental feature and might change at any time …pnpm · unclassified-diagnostic · outer pnpm · gap stage-unknownКачество данных: complete · Варианты среды: 1 · Первая запись: 2026-09-01 · Последнее наблюдение: 2026-09-15Кандидат на диагностическую перепроверку
-
наблюдалось UNKNOWN exit 1 ERR_PNPM_RECURSIVE_EXEC_FIRST_FAIL Пробел в данных ×11 4.4.3 executionContext=node · moduleSystem=esm · os=windows · runtime=node@24.13 sha256:73873d2c4aed…<str> is not recognized as an internal or external command, · operable program or batch file. · undefined …pnpm · unclassified-diagnostic · outer pnpm · gap stage-unknownКачество данных: complete · Варианты среды: 1 · Первая запись: 2026-09-01 · Последнее наблюдение: 2026-09-01Кандидат на диагностическую перепроверку
-
наблюдалось PROJECT_TEST exit 1 ELIFECYCLE ×10 4.4.3 executionContext=node · moduleSystem=esm · os=windows · runtime=node@24.13 sha256:7711694d48fa…ELIFECYCLE Test failed. See above for more details.javascript/test-runner · test-runner-diagnostic · outer pnpm testКачество данных: complete · Варианты среды: 1 · Первая запись: 2026-08-29 · Последнее наблюдение: 2026-09-01
-
наблюдалось PROJECT_TEST ENOENT Пробел в данных ×8 4.4.3 executionContext=node · os=windowsКачество данных: legacy-evidence-incomplete · Варианты среды: 5 · Первая запись: 2026-08-18 · Последнее наблюдение: 2026-08-26Кандидат на диагностическую перепроверку
-
наблюдалось PROJECT_COMPILE exit 2 TS2307 ×8 3.2.7 → 4.4.3 executionContext=node · moduleSystem=cjs · os=windows · runtime=node@24.13 sha256:0470f88d95bb…lib/hooks/queries/index.ts(<n>,<n>): error TS2307: Cannot find module <str> or its corresponding type declarations. …typescript/tsc · compiler-diagnosticКачество данных: complete · Варианты среды: 1 · Первая запись: 2026-09-01 · Последнее наблюдение: 2026-09-01
-
наблюдалось PROJECT_COMPILE exit 2 TS7006 ×8 3.2.7 → 4.4.3 executionContext=node · moduleSystem=cjs · os=windows · runtime=node@24.13 sha256:21025cd78572…app/api/politicians/[id]/real-estates/route.ts(<n>,<n>): error TS7006: Parameter <str> implicitly has an <str> type. …typescript/tsc · compiler-diagnosticКачество данных: complete · Варианты среды: 1 · Первая запись: 2026-09-01 · Последнее наблюдение: 2026-09-01
-
наблюдалось PROJECT_COMPILE exit 2 TS2561 ×8 3.2.7 → 4.4.3 executionContext=node · moduleSystem=cjs · os=windows · runtime=node@24.13 sha256:5f96e966539e…app/api/politicians/[id]/real-estates/route.ts(<n>,<n>): error TS2561: Object literal may only specify known properties, but <str> does not exist in type …typescript/tsc · compiler-diagnosticКачество данных: complete · Варианты среды: 1 · Первая запись: 2026-09-01 · Последнее наблюдение: 2026-09-01
-
наблюдалось PROJECT_COMPILE exit 2 TS2345 ×8 3.2.7 → 4.4.3 executionContext=node · moduleSystem=cjs · os=windows · runtime=node@24.13 sha256:7e077f646acc…lib/api/real-estate-statistics.ts(<n>,<n>): error TS2345: Argument of type <str> is not assignable to parameter of type <str>.typescript/tsc · compiler-diagnosticКачество данных: complete · Варианты среды: 1 · Первая запись: 2026-09-01 · Последнее наблюдение: 2026-09-01
-
наблюдалось PROJECT_COMPILE exit 2 TS2551 ×8 3.2.7 → 4.4.3 executionContext=node · moduleSystem=cjs · os=windows · runtime=node@24.13 sha256:8a1ebc675f2b…app/api/politicians/[id]/real-estates/route.ts(<n>,<n>): error TS2551: Property <str> does not exist on type <str>. Did you mean <str>? …typescript/tsc · compiler-diagnosticКачество данных: complete · Варианты среды: 1 · Первая запись: 2026-09-01 · Последнее наблюдение: 2026-09-01
Показаны 12 наиболее часто сообщаемых из 333 записанных кластеров отказов. Остальные — единичные сообщения.