Registrosnpmdebug4.4.3
Cambiar las condiciones
Condiciones actuales
debug @4.4.3windows 11 · x64 · node 24 · pnpm 10 · node
total del paquete, no una API
0 de 229 pasaron
Verificado: esta red ejecutó un contrato en esta coordenada.
hay una muestra aquí y nuestra ejecución en esta coordenada falló (1)
- Observaciones de proyectos
- 326 / 424
- Verificaciones de contrato
- 0 / 229
- Registros de uso
- 1.256
- Peers independientes que reportaron
- 1
- Fallos con huella capturada
- 95 / 98
- Último registro
- 2026-09-26
Salud de dependencias
Combinaciones observadas y evidencia de fallos para esta versión
Primer fallo observado
4.4.3
executionContext=node
60 FAIL · stage: PROJECT_PROCESS
| Biblioteca | Versión | Estado | Medido allí | Proyectos |
|---|---|---|---|---|
| ms | 2.1.3 | CANDIDATE Cambio correlacionado; combinación no probada | contrato aprobado | 434 días-proyecto |
La columna de medición se refiere a la versión de cada dependencia en sí, no al par. Que un resolutor haya colocado dos versiones juntas no prueba que funcionen juntas.
Versiones de dependencias por versión
A qué resolvió sus hijos cada versión de este paquete. Primero va el hijo cuya versión se movió: ahí una actualización cambió algo bajo tus pies.
Se movieron: 1 · iguales en todas las versiones: 0
Una arista registra que un resolutor colocó una versión junto a otra en una máquina real. No afirma que ambas funcionen juntas; a esa pregunta responden las muestras y los contratos, no la presencia de una fila.
Clústeres de fallos recientes
-
observado PROJECT_PROCESS ERR_ASSERTION Brecha de evidencia ×60 2.6.9 → 4.3.7 → 4.4.3 executionContext=nodeCalidad de evidencia: legacy-evidence-incomplete · Variantes de entorno: 3 · Primer registro: 2026-08-13 · Última observación: 2026-08-30Candidato a reverificación diagnóstica
-
observado PROCESS_START process start failed Brecha de evidencia ×51 2.6.9 → 4.4.3 executionContext=node sha256:c12549970456…· structured-termination · gap diagnostic-missingCalidad de evidencia: partial · Variantes de entorno: 4 · Primer registro: 2026-08-29 · Última observación: 2026-09-16Candidato a reverificación diagnóstica
-
observado UNKNOWN exit 1 ERR_PNPM_RECURSIVE_RUN_FIRST_FAIL Brecha de evidencia ×32 4.4.3 executionContext=node · moduleSystem=esm · os=windows · runtime=node@24.13 sha256:9f91c9753081…(node:<n>) ExperimentalWarning: SQLite is an experimental feature and might change at any time …pnpm · unclassified-diagnostic · outer pnpm · gap stage-unknownCalidad de evidencia: complete · Variantes de entorno: 1 · Primer registro: 2026-09-01 · Última observación: 2026-09-17Candidato a reverificación diagnóstica
-
observado UNKNOWN exit 1 ERR_PNPM_RECURSIVE_EXEC_FIRST_FAIL Brecha de evidencia ×28 4.4.3 executionContext=node · moduleSystem=esm · os=windows · runtime=node@24.13 sha256:979755e6489d…(node:<n>) ExperimentalWarning: SQLite is an experimental feature and might change at any time …pnpm · unclassified-diagnostic · outer pnpm · gap stage-unknownCalidad de evidencia: complete · Variantes de entorno: 1 · Primer registro: 2026-09-01 · Última observación: 2026-09-15Candidato a reverificación diagnóstica
-
observado UNKNOWN exit 1 ERR_PNPM_RECURSIVE_EXEC_FIRST_FAIL Brecha de evidencia ×11 4.4.3 executionContext=node · moduleSystem=esm · os=windows · runtime=node@24.13 sha256:73873d2c4aed…<str> is not recognized as an internal or external command, · operable program or batch file. · undefined …pnpm · unclassified-diagnostic · outer pnpm · gap stage-unknownCalidad de evidencia: complete · Variantes de entorno: 1 · Primer registro: 2026-09-01 · Última observación: 2026-09-01Candidato a reverificación diagnóstica
-
observado PROJECT_TEST exit 1 ELIFECYCLE ×10 4.4.3 executionContext=node · moduleSystem=esm · os=windows · runtime=node@24.13 sha256:7711694d48fa…ELIFECYCLE Test failed. See above for more details.javascript/test-runner · test-runner-diagnostic · outer pnpm testCalidad de evidencia: complete · Variantes de entorno: 1 · Primer registro: 2026-08-29 · Última observación: 2026-09-01
-
observado PROJECT_TEST ENOENT Brecha de evidencia ×8 4.4.3 executionContext=node · os=windowsCalidad de evidencia: legacy-evidence-incomplete · Variantes de entorno: 5 · Primer registro: 2026-08-18 · Última observación: 2026-08-26Candidato a reverificación diagnóstica
-
observado PROJECT_COMPILE exit 2 TS2307 ×8 3.2.7 → 4.4.3 executionContext=node · moduleSystem=cjs · os=windows · runtime=node@24.13 sha256:0470f88d95bb…lib/hooks/queries/index.ts(<n>,<n>): error TS2307: Cannot find module <str> or its corresponding type declarations. …typescript/tsc · compiler-diagnosticCalidad de evidencia: complete · Variantes de entorno: 1 · Primer registro: 2026-09-01 · Última observación: 2026-09-01
-
observado PROJECT_COMPILE exit 2 TS7006 ×8 3.2.7 → 4.4.3 executionContext=node · moduleSystem=cjs · os=windows · runtime=node@24.13 sha256:21025cd78572…app/api/politicians/[id]/real-estates/route.ts(<n>,<n>): error TS7006: Parameter <str> implicitly has an <str> type. …typescript/tsc · compiler-diagnosticCalidad de evidencia: complete · Variantes de entorno: 1 · Primer registro: 2026-09-01 · Última observación: 2026-09-01
-
observado PROJECT_COMPILE exit 2 TS2561 ×8 3.2.7 → 4.4.3 executionContext=node · moduleSystem=cjs · os=windows · runtime=node@24.13 sha256:5f96e966539e…app/api/politicians/[id]/real-estates/route.ts(<n>,<n>): error TS2561: Object literal may only specify known properties, but <str> does not exist in type …typescript/tsc · compiler-diagnosticCalidad de evidencia: complete · Variantes de entorno: 1 · Primer registro: 2026-09-01 · Última observación: 2026-09-01
-
observado PROJECT_COMPILE exit 2 TS2345 ×8 3.2.7 → 4.4.3 executionContext=node · moduleSystem=cjs · os=windows · runtime=node@24.13 sha256:7e077f646acc…lib/api/real-estate-statistics.ts(<n>,<n>): error TS2345: Argument of type <str> is not assignable to parameter of type <str>.typescript/tsc · compiler-diagnosticCalidad de evidencia: complete · Variantes de entorno: 1 · Primer registro: 2026-09-01 · Última observación: 2026-09-01
-
observado PROJECT_COMPILE exit 2 TS2551 ×8 3.2.7 → 4.4.3 executionContext=node · moduleSystem=cjs · os=windows · runtime=node@24.13 sha256:8a1ebc675f2b…app/api/politicians/[id]/real-estates/route.ts(<n>,<n>): error TS2551: Property <str> does not exist on type <str>. Did you mean <str>? …typescript/tsc · compiler-diagnosticCalidad de evidencia: complete · Variantes de entorno: 1 · Primer registro: 2026-09-01 · Última observación: 2026-09-01
Se muestran los 12 más reportados de 333 grupos de fallos registrados. El resto son reportes únicos.