기록npmdebug4.4.3
조건 변경
현재 조건
debug @4.4.3windows 11 · x64 · node 24 · npm 11 · node
API가 아니라 패키지 전체 집계
91회 중 0회 통과
검증 — 이 네트워크가 이 좌표에서 컨트랙트를 직접 실행했습니다.
샘플 있음 — 이 좌표에서 우리가 실행했고 실패함 (1)
- 프로젝트 관측
- 270 / 379
- 컨트랙트 검증
- 0 / 91
- 사용 기록
- 405
- 독립 보고 peer
- 2
- fingerprint가 수집된 실패
- 90 / 109
- 마지막 기록
- 2026-09-26
열어 볼 수 있는 증거
의존성 건강도
이 릴리스의 의존성 조합과 실패 관측 결과
관측된 문제 1건 ·
변경 1건 ·
정상 0건
| 라이브러리 | 버전 | 건강도 | 그 좌표에서 측정된 것 | 프로젝트 |
|---|---|---|---|---|
| ms | 2.1.3 | CANDIDATE 상관 변경; 조합 결과 미증명 | 컨트랙트 통과 | 프로젝트-일 434개 |
측정 열은 각 의존성 자신의 릴리스에 대한 것이지 두 릴리스의 조합에 대한 것이 아닙니다. 리졸버가 둘을 나란히 놓았다는 사실은 함께 동작한다는 증거가 아닙니다.
릴리스별 의존성 버전
이 패키지의 릴리스마다 자식이 어떤 버전으로 해석됐는지입니다. 버전이 움직인 자식이 먼저 나옵니다 — 업그레이드가 발밑에서 무언가를 바꾼 지점입니다.
움직임: 1 · 모든 릴리스에서 동일: 0
엣지는 실제 기계에서 리졸버가 한 릴리스를 다른 릴리스 옆에 놓았다는 기록입니다. 둘이 함께 동작한다는 주장이 아닙니다. 그 질문은 여기 행이 있다는 사실이 아니라 샘플과 컨트랙트가 답합니다.
최근 실패 클러스터
-
관측됨 PROJECT_PROCESS ERR_ASSERTION 증거 공백 ×60 2.6.9 → 4.3.7 → 4.4.3 executionContext=node증거 품질: legacy-evidence-incomplete · 환경 변형: 3 · 최초 관측: 2026-08-13 · 마지막 관측: 2026-08-30진단 재검증 후보
-
관측됨 PROCESS_START process start failed 증거 공백 ×51 2.6.9 → 4.4.3 executionContext=node sha256:c12549970456…· structured-termination · gap diagnostic-missing증거 품질: partial · 환경 변형: 4 · 최초 관측: 2026-08-29 · 마지막 관측: 2026-09-16진단 재검증 후보
-
관측됨 UNKNOWN exit 1 ERR_PNPM_RECURSIVE_RUN_FIRST_FAIL 증거 공백 ×32 4.4.3 executionContext=node · moduleSystem=esm · os=windows · runtime=node@24.13 sha256:9f91c9753081…(node:<n>) ExperimentalWarning: SQLite is an experimental feature and might change at any time …pnpm · unclassified-diagnostic · outer pnpm · gap stage-unknown증거 품질: complete · 환경 변형: 1 · 최초 관측: 2026-09-01 · 마지막 관측: 2026-09-17진단 재검증 후보
-
관측됨 UNKNOWN exit 1 ERR_PNPM_RECURSIVE_EXEC_FIRST_FAIL 증거 공백 ×28 4.4.3 executionContext=node · moduleSystem=esm · os=windows · runtime=node@24.13 sha256:979755e6489d…(node:<n>) ExperimentalWarning: SQLite is an experimental feature and might change at any time …pnpm · unclassified-diagnostic · outer pnpm · gap stage-unknown증거 품질: complete · 환경 변형: 1 · 최초 관측: 2026-09-01 · 마지막 관측: 2026-09-15진단 재검증 후보
-
관측됨 UNKNOWN exit 1 ERR_PNPM_RECURSIVE_EXEC_FIRST_FAIL 증거 공백 ×11 4.4.3 executionContext=node · moduleSystem=esm · os=windows · runtime=node@24.13 sha256:73873d2c4aed…<str> is not recognized as an internal or external command, · operable program or batch file. · undefined …pnpm · unclassified-diagnostic · outer pnpm · gap stage-unknown증거 품질: complete · 환경 변형: 1 · 최초 관측: 2026-09-01 · 마지막 관측: 2026-09-01진단 재검증 후보
-
관측됨 PROJECT_TEST exit 1 ELIFECYCLE ×10 4.4.3 executionContext=node · moduleSystem=esm · os=windows · runtime=node@24.13 sha256:7711694d48fa…ELIFECYCLE Test failed. See above for more details.javascript/test-runner · test-runner-diagnostic · outer pnpm test증거 품질: complete · 환경 변형: 1 · 최초 관측: 2026-08-29 · 마지막 관측: 2026-09-01
-
관측됨 PROJECT_TEST ENOENT 증거 공백 ×8 4.4.3 executionContext=node · os=windows증거 품질: legacy-evidence-incomplete · 환경 변형: 5 · 최초 관측: 2026-08-18 · 마지막 관측: 2026-08-26진단 재검증 후보
-
관측됨 PROJECT_COMPILE exit 2 TS2307 ×8 3.2.7 → 4.4.3 executionContext=node · moduleSystem=cjs · os=windows · runtime=node@24.13 sha256:0470f88d95bb…lib/hooks/queries/index.ts(<n>,<n>): error TS2307: Cannot find module <str> or its corresponding type declarations. …typescript/tsc · compiler-diagnostic증거 품질: complete · 환경 변형: 1 · 최초 관측: 2026-09-01 · 마지막 관측: 2026-09-01
-
관측됨 PROJECT_COMPILE exit 2 TS7006 ×8 3.2.7 → 4.4.3 executionContext=node · moduleSystem=cjs · os=windows · runtime=node@24.13 sha256:21025cd78572…app/api/politicians/[id]/real-estates/route.ts(<n>,<n>): error TS7006: Parameter <str> implicitly has an <str> type. …typescript/tsc · compiler-diagnostic증거 품질: complete · 환경 변형: 1 · 최초 관측: 2026-09-01 · 마지막 관측: 2026-09-01
-
관측됨 PROJECT_COMPILE exit 2 TS2561 ×8 3.2.7 → 4.4.3 executionContext=node · moduleSystem=cjs · os=windows · runtime=node@24.13 sha256:5f96e966539e…app/api/politicians/[id]/real-estates/route.ts(<n>,<n>): error TS2561: Object literal may only specify known properties, but <str> does not exist in type …typescript/tsc · compiler-diagnostic증거 품질: complete · 환경 변형: 1 · 최초 관측: 2026-09-01 · 마지막 관측: 2026-09-01
-
관측됨 PROJECT_COMPILE exit 2 TS2345 ×8 3.2.7 → 4.4.3 executionContext=node · moduleSystem=cjs · os=windows · runtime=node@24.13 sha256:7e077f646acc…lib/api/real-estate-statistics.ts(<n>,<n>): error TS2345: Argument of type <str> is not assignable to parameter of type <str>.typescript/tsc · compiler-diagnostic증거 품질: complete · 환경 변형: 1 · 최초 관측: 2026-09-01 · 마지막 관측: 2026-09-01
-
관측됨 PROJECT_COMPILE exit 2 TS2551 ×8 3.2.7 → 4.4.3 executionContext=node · moduleSystem=cjs · os=windows · runtime=node@24.13 sha256:8a1ebc675f2b…app/api/politicians/[id]/real-estates/route.ts(<n>,<n>): error TS2551: Property <str> does not exist on type <str>. Did you mean <str>? …typescript/tsc · compiler-diagnostic증거 품질: complete · 환경 변형: 1 · 최초 관측: 2026-09-01 · 마지막 관측: 2026-09-01
가장 많이 보고된 12개를 보여줍니다. 이 좌표에 기록된 실패 클러스터는 333개입니다. 나머지는 단발 보고입니다.