Relevésnpmdebug4.4.3
Changer les conditions
Conditions actuelles
debug @4.4.3windows 11 · x64 · node 24 · pnpm 10 · node
total du paquet, pas une API
0 sur 220 ont réussi
Vérifié — ce réseau a exécuté un contrat à cette coordonnée.
il y a un échantillon ici et notre exécution à cette coordonnée a échoué (1)
- Observations de projets
- 319 / 412
- Vérifications de contrat
- 0 / 220
- Enregistrements d'usage
- 1 200
- Pairs rapporteurs indépendants
- 1
- Échecs avec empreinte capturée
- 90 / 93
- Dernier enregistrement
- 2026-09-16
Santé des dépendances
Combinaisons observées et preuves d'échec pour cette version
Premier échec observé
4.4.3
executionContext=node
60 FAIL · stage: PROJECT_PROCESS
| Bibliothèque | Version | Santé | Mesuré là-bas | Projets |
|---|---|---|---|---|
| ms | 2.1.3 | CANDIDATE Changement corrélé; combinaison non prouvée | contrat réussi | 430 jours-projet |
La colonne de mesure porte sur la version de chaque dépendance elle-même, pas sur la paire. Qu'un résolveur ait placé deux versions côte à côte ne prouve pas qu'elles fonctionnent ensemble.
Versions des dépendances au fil des versions
Ce vers quoi chaque version de ce paquet a résolu ses enfants. L'enfant dont la version a bougé vient en premier : c'est là qu'une mise à jour a changé quelque chose sous vos pieds.
Ont bougé : 1 · identiques à chaque version : 0
Une arête indique qu'un résolveur a placé une version à côté d'une autre sur une machine réelle. Ce n'est pas une affirmation qu'elles fonctionnent ensemble ; à cette question répondent les échantillons et les contrats, pas la présence d'une ligne.
Clusters d'échecs récents
-
observé PROJECT_PROCESS ERR_ASSERTION Lacune de preuve ×60 2.6.9 → 4.3.7 → 4.4.3 executionContext=nodeQualité de preuve: legacy-evidence-incomplete · Variantes d’environnement: 3 · Premier relevé: 2026-08-13 · Dernière observation: 2026-08-30Candidat à une revérification diagnostique
-
observé PROCESS_START process start failed Lacune de preuve ×51 2.6.9 → 4.4.3 executionContext=node sha256:c12549970456…· structured-termination · gap diagnostic-missingQualité de preuve: partial · Variantes d’environnement: 4 · Premier relevé: 2026-08-29 · Dernière observation: 2026-09-16Candidat à une revérification diagnostique
-
observé UNKNOWN exit 1 ERR_PNPM_RECURSIVE_RUN_FIRST_FAIL Lacune de preuve ×31 4.4.3 executionContext=node · moduleSystem=esm · os=windows · runtime=node@24.13 sha256:9f91c9753081…(node:<n>) ExperimentalWarning: SQLite is an experimental feature and might change at any time …pnpm · unclassified-diagnostic · outer pnpm · gap stage-unknownQualité de preuve: complete · Variantes d’environnement: 1 · Premier relevé: 2026-09-01 · Dernière observation: 2026-09-15Candidat à une revérification diagnostique
-
observé UNKNOWN exit 1 ERR_PNPM_RECURSIVE_EXEC_FIRST_FAIL Lacune de preuve ×28 4.4.3 executionContext=node · moduleSystem=esm · os=windows · runtime=node@24.13 sha256:979755e6489d…(node:<n>) ExperimentalWarning: SQLite is an experimental feature and might change at any time …pnpm · unclassified-diagnostic · outer pnpm · gap stage-unknownQualité de preuve: complete · Variantes d’environnement: 1 · Premier relevé: 2026-09-01 · Dernière observation: 2026-09-15Candidat à une revérification diagnostique
-
observé UNKNOWN exit 1 ERR_PNPM_RECURSIVE_EXEC_FIRST_FAIL Lacune de preuve ×11 4.4.3 executionContext=node · moduleSystem=esm · os=windows · runtime=node@24.13 sha256:73873d2c4aed…<str> is not recognized as an internal or external command, · operable program or batch file. · undefined …pnpm · unclassified-diagnostic · outer pnpm · gap stage-unknownQualité de preuve: complete · Variantes d’environnement: 1 · Premier relevé: 2026-09-01 · Dernière observation: 2026-09-01Candidat à une revérification diagnostique
-
observé PROJECT_TEST exit 1 ELIFECYCLE ×10 4.4.3 executionContext=node · moduleSystem=esm · os=windows · runtime=node@24.13 sha256:7711694d48fa…ELIFECYCLE Test failed. See above for more details.javascript/test-runner · test-runner-diagnostic · outer pnpm testQualité de preuve: complete · Variantes d’environnement: 1 · Premier relevé: 2026-08-29 · Dernière observation: 2026-09-01
-
observé PROJECT_TEST ENOENT Lacune de preuve ×8 4.4.3 executionContext=node · os=windowsQualité de preuve: legacy-evidence-incomplete · Variantes d’environnement: 5 · Premier relevé: 2026-08-18 · Dernière observation: 2026-08-26Candidat à une revérification diagnostique
-
observé PROJECT_COMPILE exit 2 TS2307 ×8 3.2.7 → 4.4.3 executionContext=node · moduleSystem=cjs · os=windows · runtime=node@24.13 sha256:0470f88d95bb…lib/hooks/queries/index.ts(<n>,<n>): error TS2307: Cannot find module <str> or its corresponding type declarations. …typescript/tsc · compiler-diagnosticQualité de preuve: complete · Variantes d’environnement: 1 · Premier relevé: 2026-09-01 · Dernière observation: 2026-09-01
-
observé PROJECT_COMPILE exit 2 TS7006 ×8 3.2.7 → 4.4.3 executionContext=node · moduleSystem=cjs · os=windows · runtime=node@24.13 sha256:21025cd78572…app/api/politicians/[id]/real-estates/route.ts(<n>,<n>): error TS7006: Parameter <str> implicitly has an <str> type. …typescript/tsc · compiler-diagnosticQualité de preuve: complete · Variantes d’environnement: 1 · Premier relevé: 2026-09-01 · Dernière observation: 2026-09-01
-
observé PROJECT_COMPILE exit 2 TS2561 ×8 3.2.7 → 4.4.3 executionContext=node · moduleSystem=cjs · os=windows · runtime=node@24.13 sha256:5f96e966539e…app/api/politicians/[id]/real-estates/route.ts(<n>,<n>): error TS2561: Object literal may only specify known properties, but <str> does not exist in type …typescript/tsc · compiler-diagnosticQualité de preuve: complete · Variantes d’environnement: 1 · Premier relevé: 2026-09-01 · Dernière observation: 2026-09-01
-
observé PROJECT_COMPILE exit 2 TS2345 ×8 3.2.7 → 4.4.3 executionContext=node · moduleSystem=cjs · os=windows · runtime=node@24.13 sha256:7e077f646acc…lib/api/real-estate-statistics.ts(<n>,<n>): error TS2345: Argument of type <str> is not assignable to parameter of type <str>.typescript/tsc · compiler-diagnosticQualité de preuve: complete · Variantes d’environnement: 1 · Premier relevé: 2026-09-01 · Dernière observation: 2026-09-01
-
observé PROJECT_COMPILE exit 2 TS2551 ×8 3.2.7 → 4.4.3 executionContext=node · moduleSystem=cjs · os=windows · runtime=node@24.13 sha256:8a1ebc675f2b…app/api/politicians/[id]/real-estates/route.ts(<n>,<n>): error TS2551: Property <str> does not exist on type <str>. Did you mean <str>? …typescript/tsc · compiler-diagnosticQualité de preuve: complete · Variantes d’environnement: 1 · Premier relevé: 2026-09-01 · Dernière observation: 2026-09-01
Affichage des 12 plus signalés parmi 330 groupes d’échecs enregistrés. Le reste sont des signalements uniques.