Записиnpmcors2.8.6
Изменить условия
Текущие условия
cors @2.8.6ubuntu glibc · x64 · node 22 · npm 10 · node
итог по пакету, а не API
0 из 3 прошли
Проверено — эта сеть выполнила контракт в этой координате.
образец есть — наш запуск в этой координате не прошёл (1)
- Наблюдения в проектах
- 22 / 23
- Проверки контрактом
- 0 / 3
- Записи об использовании
- 13
- Независимые сообщившие пиры
- 2
- Сбои с собранным отпечатком
- 0 / 1
- Последняя запись
- 2026-08-31
Свидетельства, которые можно открыть
Здоровье зависимостей
Наблюдаемые комбинации и свидетельства сбоев для этого выпуска
Замечено проблем: 1 ·
Стабильно: 2
Первый обнаруженный сбой
2.8.6
windows · node@24.13 · executionContext=node · moduleSystem=esm
31 FAIL
· stage: UNKNOWN
· fingerprint: sha256:9f91c975308128a0f4f23e33b9d5936b9c39535b5c01aa9245b8cdc4b0a37a10
| Библиотека | Версия | Состояние | Измерено там | Проектов |
|---|---|---|---|---|
| object-assign | 4.1.1 | PASS Все наблюдения прошли успешно | контракт пройден | 14 проектных дней |
| vary | 1.1.2 | PASS Все наблюдения прошли успешно | контракт пройден | 13 проектных дней |
Столбец измерения относится к релизу самой зависимости, а не к паре. То, что резолвер поставил два релиза рядом, не доказывает, что они работают вместе.
Недавние кластеры сбоев
-
наблюдалось PROJECT_PROCESS ERR_MODULE_NOT_FOUND Пробел в данных ×3 2.8.6 executionContext=nodeКачество данных: legacy-evidence-incomplete · Варианты среды: 2 · Первая запись: 2026-08-14 · Последнее наблюдение: 2026-08-21Кандидат на диагностическую перепроверку
-
наблюдалось UNKNOWN exit 1 ERR_ASSERTION Пробел в данных ×1 2.8.6 executionContext=node · moduleSystem=cjs · os=linux · runtime=node@22.23 sha256:b5be31ef74e1…Contract test failed: AssertionError [ERR_ASSERTION]: Preflight allowed headers must match · + actual - expected · + <str> · - <str>node · unclassified-diagnostic · outer node · gap stage-unknownКачество данных: complete · Варианты среды: 1 · Первая запись: 2026-08-30 · Последнее наблюдение: 2026-08-30Кандидат на диагностическую перепроверку
-
наблюдалось UNKNOWN exit 1 ERR_ASSERTION Пробел в данных ×1 2.8.6 executionContext=node · moduleSystem=esm · os=linux · runtime=node@22.23 sha256:986d98189e70…node:internal/modules/run_main:<n> · triggerUncaughtException( · ^ · AssertionError [ERR_ASSERTION]: Expected values to be strictly equal:node · unclassified-diagnostic · outer node · gap stage-unknownКачество данных: complete · Варианты среды: 1 · Первая запись: 2026-08-31 · Последнее наблюдение: 2026-08-31Кандидат на диагностическую перепроверку
-
наблюдалось UNKNOWN exit 1 Пробел в данных ×1 2.8.6 executionContext=node · moduleSystem=cjs · os=linux · runtime=node@22.23 sha256:9be950af9140…Traceback (most recent call last): · File <str>, line 1, in <module> · ModuleNotFoundError: No module named <str>python3 · unclassified-diagnostic · outer python3 · gap stage-unknownКачество данных: complete · Варианты среды: 1 · Первая запись: 2026-08-31 · Последнее наблюдение: 2026-08-31Кандидат на диагностическую перепроверку