Registrosnpmcors2.8.6
Cambiar las condiciones
Condiciones actuales
cors @2.8.6debian glibc · x64 · node 22 · npm · node
total del paquete, no una API
Registrado como presente en proyectos. No se ejecutó nada en esta coordenada.
Observado: builds reales de proyectos reportaron desde esta coordenada.
hay una muestra aquí y todavía no la hemos ejecutado en esta coordenada (1)
- Observaciones de proyectos
- nada en esta coordenada
- Verificaciones de contrato
- nada en esta coordenada
- Registros de uso
- 1
- Peers independientes que reportaron
- 1
- Último registro
- 2026-09-01
Salud de dependencias
Combinaciones observadas y evidencia de fallos para esta versión
Primer fallo observado
2.8.6
windows · node@24.13 · moduleSystem=esm · executionContext=node
31 FAIL
· stage: UNKNOWN
· fingerprint: sha256:9f91c975308128a0f4f23e33b9d5936b9c39535b5c01aa9245b8cdc4b0a37a10
| Biblioteca | Versión | Estado | Medido allí | Proyectos |
|---|---|---|---|---|
| object-assign | 4.1.1 | PASS Todas las observaciones pasaron | contrato aprobado | 14 días-proyecto |
| vary | 1.1.2 | PASS Todas las observaciones pasaron | contrato aprobado | 13 días-proyecto |
La columna de medición se refiere a la versión de cada dependencia en sí, no al par. Que un resolutor haya colocado dos versiones juntas no prueba que funcionen juntas.
Clústeres de fallos recientes
-
observado PROJECT_PROCESS ERR_MODULE_NOT_FOUND Brecha de evidencia ×3 2.8.6 executionContext=nodeCalidad de evidencia: legacy-evidence-incomplete · Variantes de entorno: 2 · Primer registro: 2026-08-14 · Última observación: 2026-08-21Candidato a reverificación diagnóstica
-
observado UNKNOWN exit 1 ERR_ASSERTION Brecha de evidencia ×1 2.8.6 executionContext=node · moduleSystem=cjs · os=linux · runtime=node@22.23 sha256:b5be31ef74e1…Contract test failed: AssertionError [ERR_ASSERTION]: Preflight allowed headers must match · + actual - expected · + <str> · - <str>node · unclassified-diagnostic · outer node · gap stage-unknownCalidad de evidencia: complete · Variantes de entorno: 1 · Primer registro: 2026-08-30 · Última observación: 2026-08-30Candidato a reverificación diagnóstica
-
observado UNKNOWN exit 1 ERR_ASSERTION Brecha de evidencia ×1 2.8.6 executionContext=node · moduleSystem=esm · os=linux · runtime=node@22.23 sha256:986d98189e70…node:internal/modules/run_main:<n> · triggerUncaughtException( · ^ · AssertionError [ERR_ASSERTION]: Expected values to be strictly equal:node · unclassified-diagnostic · outer node · gap stage-unknownCalidad de evidencia: complete · Variantes de entorno: 1 · Primer registro: 2026-08-31 · Última observación: 2026-08-31Candidato a reverificación diagnóstica
-
observado UNKNOWN exit 1 Brecha de evidencia ×1 2.8.6 executionContext=node · moduleSystem=cjs · os=linux · runtime=node@22.23 sha256:9be950af9140…Traceback (most recent call last): · File <str>, line 1, in <module> · ModuleNotFoundError: No module named <str>python3 · unclassified-diagnostic · outer python3 · gap stage-unknownCalidad de evidencia: complete · Variantes de entorno: 1 · Primer registro: 2026-08-31 · Última observación: 2026-08-31Candidato a reverificación diagnóstica