記録npmchai5.3.3chai.Assertion
条件を変更
現在の条件
chai.Assertion @5.3.3ubuntu glibc · x64 · node 22 · npm 10 · node
2 回中 0 回が成功
検証 — このネットワークがこの座標でコントラクトを実行しました。
サンプルあり — この座標で実行し、失敗した
- プロジェクト観測
- 2 / 2
- コントラクト検証
- 0 / 2
- 独立した報告ピア
- 1
- 最終記録
- 2026-09-03
開ける証拠
依存関係のヘルス
このリリースの依存関係の組み合わせと失敗観測
観測された問題 1件 ·
正常 5件
| ライブラリ | バージョン | ヘルス | その座標で測定されたこと | プロジェクト |
|---|---|---|---|---|
| assertion-error | 2.0.1 | PASS すべての観測で成功 | コントラクト合格 | プロジェクト日 57 件 |
| check-error | 2.1.3 | PASS すべての観測で成功 | コントラクト合格 | プロジェクト日 53 件 |
| deep-eql | 5.0.2 | PASS すべての観測で成功 | コントラクト合格 | プロジェクト日 53 件 |
| loupe | 3.2.1 | PASS すべての観測で成功 | コントラクト合格 | プロジェクト日 53 件 |
| pathval | 2.0.1 | PASS すべての観測で成功 | コントラクト合格 | プロジェクト日 52 件 |
測定列は各依存関係自身のリリースに関するもので、2つのリリースの組み合わせに関するものではありません。リゾルバが2つを並べたという事実は、両者が協調して動く証拠ではありません。
最近の失敗クラスター
-
観測済み PROCESS_START process start failed 証拠の欠落 ×14 5.3.3 executionContext=node sha256:c12549970456…· structured-termination · gap diagnostic-missing証拠品質: partial · 環境バリアント: 3 · 初回記録: 2026-08-31 · 最終観測: 2026-09-16診断再検証候補
-
観測済み PROJECT_PROCESS ERR_MODULE_NOT_FOUND 証拠の欠落 ×5 5.3.3 → 6.2.2 executionContext=node · moduleSystem=esm証拠品質: legacy-evidence-incomplete · 環境バリアント: 2 · 初回記録: 2026-08-14 · 最終観測: 2026-08-30診断再検証候補
-
観測済み UNKNOWN exit 1 証拠の欠落 ×3 5.3.3 executionContext=node · moduleSystem=esm · os=linux · runtime=node@22.23 sha256:8fd30f2a6304…fil<path>:<n> · throw new Error(errorMsg); · ^ · Error: Vitest failed to access its internal state.node · unclassified-diagnostic · outer node · gap stage-unknown証拠品質: complete · 環境バリアント: 1 · 初回記録: 2026-08-31 · 最終観測: 2026-09-08診断再検証候補
-
観測済み UNKNOWN exit 1 証拠の欠落 ×2 5.3.3 executionContext=node · moduleSystem=esm · os=linux · runtime=node@22.23 sha256:42623a56826f…fil<path>:<n> · Object.defineProperty(expect.not, expectAssertionName, { · ^ · TypeError: Object.defineProperty called on non-objectnode · unclassified-diagnostic · outer node · gap stage-unknown証拠品質: complete · 環境バリアント: 1 · 初回記録: 2026-09-03 · 最終観測: 2026-09-04診断再検証候補
-
観測済み UNKNOWN exit 1 証拠の欠落 ×2 5.3.3 executionContext=node · moduleSystem=cjs · os=linux · runtime=node@22.23 sha256:3b3190f2cd44…doc: cannot find package <str> in any of: · ($GOROOT not set) · <path> (from $GOPATH)go · unclassified-diagnostic · outer go · gap stage-unknown証拠品質: complete · 環境バリアント: 1 · 初回記録: 2026-09-04 · 最終観測: 2026-09-04診断再検証候補
-
観測済み UNKNOWN exit 1 証拠の欠落 ×2 5.3.3 executionContext=node · moduleSystem=cjs · os=linux · runtime=node@22.23 sha256:f0288eb0529f…Traceback (most recent call last): · File <str>, line 19, in <module> · AssertionError· unclassified-diagnostic · gap stage-unknown証拠品質: complete · 環境バリアント: 1 · 初回記録: 2026-09-04 · 最終観測: 2026-09-04診断再検証候補
-
観測済み UNKNOWN exit 1 証拠の欠落 ×1 5.3.3 executionContext=node · moduleSystem=esm · os=linux · runtime=node@22.23 sha256:9d8e5c918329…Contract test failed: AssertionError: value must be typeof object: expected Map{} to be an object · at checkTypeAndInstance (<url>) …node · unclassified-diagnostic · outer node · gap stage-unknown証拠品質: complete · 環境バリアント: 1 · 初回記録: 2026-08-29 · 最終観測: 2026-08-29診断再検証候補
-
観測済み UNKNOWN exit 1 証拠の欠落 ×1 5.3.3 executionContext=node · moduleSystem=cjs · os=linux · runtime=node@22.23 sha256:72ba2d1e946f…<path>: No module named pippython3 · unclassified-diagnostic · outer python3 · gap stage-unknown証拠品質: complete · 環境バリアント: 1 · 初回記録: 2026-08-31 · 最終観測: 2026-08-31診断再検証候補
-
観測済み UNKNOWN exit 1 証拠の欠落 ×1 5.3.3 executionContext=node · moduleSystem=cjs · os=linux · runtime=node@22.23 sha256:91ad26545eb1…node:internal/modules/cjs/loader:<n> · throw err; · ^ · Error: Cannot find module <str>node · unclassified-diagnostic · outer node · gap stage-unknown証拠品質: complete · 環境バリアント: 1 · 初回記録: 2026-08-31 · 最終観測: 2026-08-31診断再検証候補
-
観測済み UNKNOWN exit 1 証拠の欠落 ×1 5.3.3 executionContext=node · moduleSystem=cjs · os=linux · runtime=node@22.23 sha256:d7f5d491441c…Traceback (most recent call last): · File <str>, line 71, in <module> · AssertionError: is_annotated must return True for Annotated· unclassified-diagnostic · gap stage-unknown証拠品質: complete · 環境バリアント: 1 · 初回記録: 2026-08-31 · 最終観測: 2026-08-31診断再検証候補
-
観測済み UNKNOWN exit 1 証拠の欠落 ×1 5.3.3 executionContext=node · moduleSystem=esm · os=linux · runtime=node@22.23 chai.Assertion sha256:67b21c7b2753…Contract test failed: TypeError: Cannot assign to read only property <str> of function 'class Assertion { · constructor(obj) { · this._obj = obj; · }node · unclassified-diagnostic · outer node · gap stage-unknown証拠品質: complete · 環境バリアント: 1 · 初回記録: 2026-09-03 · 最終観測: 2026-09-03診断再検証候補
-
観測済み UNKNOWN exit 1 証拠の欠落 ×1 5.3.3 executionContext=node · moduleSystem=esm · os=linux · runtime=node@22.23 chai.Assertion sha256:db4b73d5113b…Contract test failed: TypeError: utils.addProperty is not a function · at JestChaiExpect (fil<path>:<n>:<n>) · at Object.use (<url>) …node · unclassified-diagnostic · outer node · gap stage-unknown証拠品質: complete · 環境バリアント: 1 · 初回記録: 2026-09-03 · 最終観測: 2026-09-03診断再検証候補
最も多く報告された 12 件を表示しています。この座標に記録された失敗クラスタは 20 件です。残りは単発の報告です。