Relevésnpmchai5.3.3chai.Assertion
Changer les conditions
Conditions actuelles
chai.Assertion @5.3.3ubuntu glibc · x64 · node 22 · npm 10 · node
0 sur 2 ont réussi
Vérifié — ce réseau a exécuté un contrat à cette coordonnée.
il y a un échantillon ici et notre exécution à cette coordonnée a échoué
- Observations de projets
- 2 / 2
- Vérifications de contrat
- 0 / 2
- Pairs rapporteurs indépendants
- 1
- Dernier enregistrement
- 2026-09-03
Santé des dépendances
Combinaisons observées et preuves d'échec pour cette version
Premier échec observé
5.3.3
windows · node@24.13 · executionContext=node · moduleSystem=esm
31 FAIL
· stage: UNKNOWN
· fingerprint: sha256:9f91c975308128a0f4f23e33b9d5936b9c39535b5c01aa9245b8cdc4b0a37a10
| Bibliothèque | Version | Santé | Mesuré là-bas | Projets |
|---|---|---|---|---|
| assertion-error | 2.0.1 | PASS Toutes les observations ont réussi | contrat réussi | 57 jours-projet |
| check-error | 2.1.3 | PASS Toutes les observations ont réussi | contrat réussi | 53 jours-projet |
| deep-eql | 5.0.2 | PASS Toutes les observations ont réussi | contrat réussi | 53 jours-projet |
| loupe | 3.2.1 | PASS Toutes les observations ont réussi | contrat réussi | 53 jours-projet |
| pathval | 2.0.1 | PASS Toutes les observations ont réussi | contrat réussi | 52 jours-projet |
La colonne de mesure porte sur la version de chaque dépendance elle-même, pas sur la paire. Qu'un résolveur ait placé deux versions côte à côte ne prouve pas qu'elles fonctionnent ensemble.
Clusters d'échecs récents
-
observé PROCESS_START process start failed Lacune de preuve ×14 5.3.3 executionContext=node sha256:c12549970456…· structured-termination · gap diagnostic-missingQualité de preuve: partial · Variantes d’environnement: 3 · Premier relevé: 2026-08-31 · Dernière observation: 2026-09-16Candidat à une revérification diagnostique
-
observé PROJECT_PROCESS ERR_MODULE_NOT_FOUND Lacune de preuve ×5 5.3.3 → 6.2.2 executionContext=node · moduleSystem=esmQualité de preuve: legacy-evidence-incomplete · Variantes d’environnement: 2 · Premier relevé: 2026-08-14 · Dernière observation: 2026-08-30Candidat à une revérification diagnostique
-
observé UNKNOWN exit 1 Lacune de preuve ×3 5.3.3 executionContext=node · moduleSystem=esm · os=linux · runtime=node@22.23 sha256:8fd30f2a6304…fil<path>:<n> · throw new Error(errorMsg); · ^ · Error: Vitest failed to access its internal state.node · unclassified-diagnostic · outer node · gap stage-unknownQualité de preuve: complete · Variantes d’environnement: 1 · Premier relevé: 2026-08-31 · Dernière observation: 2026-09-08Candidat à une revérification diagnostique
-
observé UNKNOWN exit 1 Lacune de preuve ×2 5.3.3 executionContext=node · moduleSystem=esm · os=linux · runtime=node@22.23 sha256:42623a56826f…fil<path>:<n> · Object.defineProperty(expect.not, expectAssertionName, { · ^ · TypeError: Object.defineProperty called on non-objectnode · unclassified-diagnostic · outer node · gap stage-unknownQualité de preuve: complete · Variantes d’environnement: 1 · Premier relevé: 2026-09-03 · Dernière observation: 2026-09-04Candidat à une revérification diagnostique
-
observé UNKNOWN exit 1 Lacune de preuve ×2 5.3.3 executionContext=node · moduleSystem=cjs · os=linux · runtime=node@22.23 sha256:3b3190f2cd44…doc: cannot find package <str> in any of: · ($GOROOT not set) · <path> (from $GOPATH)go · unclassified-diagnostic · outer go · gap stage-unknownQualité de preuve: complete · Variantes d’environnement: 1 · Premier relevé: 2026-09-04 · Dernière observation: 2026-09-04Candidat à une revérification diagnostique
-
observé UNKNOWN exit 1 Lacune de preuve ×2 5.3.3 executionContext=node · moduleSystem=cjs · os=linux · runtime=node@22.23 sha256:f0288eb0529f…Traceback (most recent call last): · File <str>, line 19, in <module> · AssertionError· unclassified-diagnostic · gap stage-unknownQualité de preuve: complete · Variantes d’environnement: 1 · Premier relevé: 2026-09-04 · Dernière observation: 2026-09-04Candidat à une revérification diagnostique
-
observé UNKNOWN exit 1 Lacune de preuve ×1 5.3.3 executionContext=node · moduleSystem=esm · os=linux · runtime=node@22.23 sha256:9d8e5c918329…Contract test failed: AssertionError: value must be typeof object: expected Map{} to be an object · at checkTypeAndInstance (<url>) …node · unclassified-diagnostic · outer node · gap stage-unknownQualité de preuve: complete · Variantes d’environnement: 1 · Premier relevé: 2026-08-29 · Dernière observation: 2026-08-29Candidat à une revérification diagnostique
-
observé UNKNOWN exit 1 Lacune de preuve ×1 5.3.3 executionContext=node · moduleSystem=cjs · os=linux · runtime=node@22.23 sha256:72ba2d1e946f…<path>: No module named pippython3 · unclassified-diagnostic · outer python3 · gap stage-unknownQualité de preuve: complete · Variantes d’environnement: 1 · Premier relevé: 2026-08-31 · Dernière observation: 2026-08-31Candidat à une revérification diagnostique
-
observé UNKNOWN exit 1 Lacune de preuve ×1 5.3.3 executionContext=node · moduleSystem=cjs · os=linux · runtime=node@22.23 sha256:91ad26545eb1…node:internal/modules/cjs/loader:<n> · throw err; · ^ · Error: Cannot find module <str>node · unclassified-diagnostic · outer node · gap stage-unknownQualité de preuve: complete · Variantes d’environnement: 1 · Premier relevé: 2026-08-31 · Dernière observation: 2026-08-31Candidat à une revérification diagnostique
-
observé UNKNOWN exit 1 Lacune de preuve ×1 5.3.3 executionContext=node · moduleSystem=cjs · os=linux · runtime=node@22.23 sha256:d7f5d491441c…Traceback (most recent call last): · File <str>, line 71, in <module> · AssertionError: is_annotated must return True for Annotated· unclassified-diagnostic · gap stage-unknownQualité de preuve: complete · Variantes d’environnement: 1 · Premier relevé: 2026-08-31 · Dernière observation: 2026-08-31Candidat à une revérification diagnostique
-
observé UNKNOWN exit 1 Lacune de preuve ×1 5.3.3 executionContext=node · moduleSystem=esm · os=linux · runtime=node@22.23 chai.Assertion sha256:67b21c7b2753…Contract test failed: TypeError: Cannot assign to read only property <str> of function 'class Assertion { · constructor(obj) { · this._obj = obj; · }node · unclassified-diagnostic · outer node · gap stage-unknownQualité de preuve: complete · Variantes d’environnement: 1 · Premier relevé: 2026-09-03 · Dernière observation: 2026-09-03Candidat à une revérification diagnostique
-
observé UNKNOWN exit 1 Lacune de preuve ×1 5.3.3 executionContext=node · moduleSystem=esm · os=linux · runtime=node@22.23 chai.Assertion sha256:db4b73d5113b…Contract test failed: TypeError: utils.addProperty is not a function · at JestChaiExpect (fil<path>:<n>:<n>) · at Object.use (<url>) …node · unclassified-diagnostic · outer node · gap stage-unknownQualité de preuve: complete · Variantes d’environnement: 1 · Premier relevé: 2026-09-03 · Dernière observation: 2026-09-03Candidat à une revérification diagnostique
Affichage des 12 plus signalés parmi 20 groupes d’échecs enregistrés. Le reste sont des signalements uniques.