Записиnpmcall-bind-apply-helpers1.0.2
Изменить условия
Текущие условия
call-bind-apply-helpers @1.0.2ubuntu glibc · x64 · node 22 · yarn 4 · node
итог по пакету, а не API
4 из 4 прошли
Наблюдение — реальные сборки проектов сообщили об этой координате.
образец есть — в этой координате мы его ещё не запускали (1)
- Наблюдения в проектах
- 4 / 4
- Проверки контрактом
- в этой координате ничего
- Независимые сообщившие пиры
- 1
- Последняя запись
- 2026-09-07
Здоровье зависимостей
Наблюдаемые комбинации и свидетельства сбоев для этого выпуска
Первый обнаруженный сбой
1.0.2
windows · node@24.13 · moduleSystem=esm · executionContext=node
32 FAIL
· stage: UNKNOWN
· fingerprint: sha256:9f91c975308128a0f4f23e33b9d5936b9c39535b5c01aa9245b8cdc4b0a37a10
| Библиотека | Версия | Состояние | Измерено там | Проектов |
|---|---|---|---|---|
| es-errors | 1.3.0 | PASS Все наблюдения прошли успешно | контракт пройден | 81 проектный день |
| function-bind | 1.1.2 | PASS Все наблюдения прошли успешно | контракт пройден | 80 проектных дней |
Столбец измерения относится к релизу самой зависимости, а не к паре. То, что резолвер поставил два релиза рядом, не доказывает, что они работают вместе.
Недавние кластеры сбоев
-
наблюдалось PROJECT_PROCESS ERR_MODULE_NOT_FOUND Пробел в данных ×20 1.0.2 executionContext=nodeКачество данных: legacy-evidence-incomplete · Варианты среды: 2 · Первая запись: 2026-08-13 · Последнее наблюдение: 2026-08-21Кандидат на диагностическую перепроверку
-
наблюдалось UNKNOWN exit 1 ERR_ASSERTION Пробел в данных ×3 1.0.2 executionContext=node · moduleSystem=esm · os=linux · runtime=node@22.23 sha256:986d98189e70…node:internal/modules/run_main:<n> · triggerUncaughtException( · ^ · AssertionError [ERR_ASSERTION]: Expected values to be strictly equal:node · unclassified-diagnostic · outer node · gap stage-unknownКачество данных: complete · Варианты среды: 1 · Первая запись: 2026-08-31 · Последнее наблюдение: 2026-09-20Кандидат на диагностическую перепроверку
-
наблюдалось UNKNOWN exit 1 Пробел в данных ×1 1.0.2 executionContext=node · moduleSystem=esm · os=linux · runtime=node@22.23 sha256:795cbb5ee086…Error: Cannot find module <str> · Require stack: · - <path> · - <path>node · unclassified-diagnostic · outer node · gap stage-unknownКачество данных: complete · Варианты среды: 1 · Первая запись: 2026-08-29 · Последнее наблюдение: 2026-08-29Кандидат на диагностическую перепроверку
-
наблюдалось UNKNOWN exit 1 Пробел в данных ×1 1.0.2 executionContext=node · moduleSystem=cjs · os=linux · runtime=node@22.23 sha256:0c06875294a4…Contract test failed: TypeError: Cannot read properties of undefined (reading <str>) · at runContract (<url>) …node · unclassified-diagnostic · outer node · gap stage-unknownКачество данных: complete · Варианты среды: 1 · Первая запись: 2026-08-30 · Последнее наблюдение: 2026-08-30Кандидат на диагностическую перепроверку
-
наблюдалось UNKNOWN exit 1 ERR_ASSERTION Пробел в данных ×1 1.0.2 executionContext=node · moduleSystem=cjs · os=linux · runtime=node@22.23 sha256:0d62cac8c07a…AssertionError [ERR_ASSERTION]: Expected values to be strictly equal: · + actual - expected · + <str> · - <str>node · unclassified-diagnostic · outer node · gap stage-unknownКачество данных: complete · Варианты среды: 1 · Первая запись: 2026-08-30 · Последнее наблюдение: 2026-08-30Кандидат на диагностическую перепроверку
-
наблюдалось UNKNOWN exit 1 Пробел в данных ×1 1.0.2 executionContext=node · moduleSystem=cjs · os=linux · runtime=node@22.23 sha256:9630b514e713…Contract test failed: TypeError: this.terminate is not a function · at ProgressBar.set currentAmount [as currentAmount] <path>:<n>:<n>) …node · unclassified-diagnostic · outer node · gap stage-unknownКачество данных: complete · Варианты среды: 1 · Первая запись: 2026-08-30 · Последнее наблюдение: 2026-08-30Кандидат на диагностическую перепроверку
-
наблюдалось UNKNOWN exit 1 ERR_ASSERTION Пробел в данных ×1 1.0.2 executionContext=node · moduleSystem=cjs · os=linux · runtime=node@22.23 sha256:9ed50b51742b…Contract test failed: AssertionError [ERR_ASSERTION]: Expected values to be strictly equal: · 0 !== 50 · at runContract (<url>) …node · unclassified-diagnostic · outer node · gap stage-unknownКачество данных: complete · Варианты среды: 1 · Первая запись: 2026-08-30 · Последнее наблюдение: 2026-08-30Кандидат на диагностическую перепроверку
-
наблюдалось UNKNOWN exit 1 Пробел в данных ×1 1.0.2 executionContext=node · moduleSystem=cjs · os=linux · runtime=node@22.23 sha256:a592ca8c2930…Contract test failed: TypeError: this.stream.moveCursor is not a function · at MultiProgress.allocateLines <path>:<n>:<n>) …node · unclassified-diagnostic · outer node · gap stage-unknownКачество данных: complete · Варианты среды: 1 · Первая запись: 2026-08-30 · Последнее наблюдение: 2026-08-30Кандидат на диагностическую перепроверку
-
наблюдалось UNKNOWN exit 1 Пробел в данных ×1 1.0.2 executionContext=node · moduleSystem=cjs · os=linux · runtime=node@22.23 sha256:e1d65fc7c136…<path>:<n> · throw new Error(`Unsupported arch ${name}`) · ^ · Error: Unsupported arch 1node · unclassified-diagnostic · outer node · gap stage-unknownКачество данных: complete · Варианты среды: 1 · Первая запись: 2026-08-30 · Последнее наблюдение: 2026-08-30Кандидат на диагностическую перепроверку
-
наблюдалось UNKNOWN exit 1 ERR_ASSERTION Пробел в данных ×1 1.0.2 executionContext=node · moduleSystem=esm · os=linux · runtime=node@22.23 sha256:c38a78d344c3…Contract verification failed: AssertionError [ERR_ASSERTION]: Expected values to be strictly equal: · + actual - expected · + [Function: createRoot$1] …node · unclassified-diagnostic · outer node · gap stage-unknownКачество данных: complete · Варианты среды: 1 · Первая запись: 2026-08-30 · Последнее наблюдение: 2026-08-30Кандидат на диагностическую перепроверку
-
наблюдалось UNKNOWN exit 1 ERR_ASSERTION Пробел в данных ×1 1.0.2 executionContext=node · moduleSystem=esm · os=linux · runtime=node@22.23 sha256:10e769edac62…node:internal/modules/run_main:<n> · triggerUncaughtException( · ^ · AssertionError [ERR_ASSERTION]: The expression evaluated to a falsy value:node · unclassified-diagnostic · outer node · gap stage-unknownКачество данных: complete · Варианты среды: 1 · Первая запись: 2026-08-31 · Последнее наблюдение: 2026-08-31Кандидат на диагностическую перепроверку
-
наблюдалось UNKNOWN exit 1 Пробел в данных ×1 1.0.2 executionContext=node · moduleSystem=cjs · os=linux · runtime=node@22.23 sha256:91ad26545eb1…node:internal/modules/cjs/loader:<n> · throw err; · ^ · Error: Cannot find module <str>node · unclassified-diagnostic · outer node · gap stage-unknownКачество данных: complete · Варианты среды: 1 · Первая запись: 2026-08-31 · Последнее наблюдение: 2026-08-31Кандидат на диагностическую перепроверку
Показаны 12 наиболее часто сообщаемых из 17 записанных кластеров отказов. Остальные — единичные сообщения.