Relevésnpmbrowserslist4.28.9browserslist.parse
Changer les conditions
Conditions actuelles
browserslist.parse @4.28.9debian glibc · x64 · node 22 · npm · node
1 sur 1 ont réussi
Vérifié — ce réseau a exécuté un contrat à cette coordonnée.
il y a un échantillon ici et notre exécution à cette coordonnée s'est terminée proprement (1)
- Observations de projets
- 1 / 1
- Vérifications de contrat
- 1 / 1
- Pairs rapporteurs indépendants
- 1
- Dernier enregistrement
- 2026-09-17
Santé des dépendances
Combinaisons observées et preuves d'échec pour cette version
Premier échec observé
4.28.9
linux · node@22.23 · executionContext=node
7 FAIL
· stage: UNKNOWN
· fingerprint: sha256:88af852f99a8104e4bc3c23eea27ebf2990625ccabf45313970f5fd7fe56c4e2
| Bibliothèque | Version | Santé | Mesuré là-bas | Projets |
|---|---|---|---|---|
| baseline-browser-mapping | 2.11.21 | CANDIDATE Changement corrélé; combinaison non prouvée | contrat réussi | 69 jours-projet |
| baseline-browser-mapping | 2.11.23 | CANDIDATE Changement corrélé; combinaison non prouvée | builds observés | 2 jours-projet |
| caniuse-lite | 1.0.30001810 | CANDIDATE Changement corrélé; combinaison non prouvée | contrat réussi | 71 jours-projet |
| electron-to-chromium | 1.5.422 | CANDIDATE Changement corrélé; combinaison non prouvée | contrat réussi | 69 jours-projet |
| electron-to-chromium | 1.5.427 | CANDIDATE Changement corrélé; combinaison non prouvée | builds observés | 2 jours-projet |
| node-releases | 2.0.54 | CANDIDATE Changement corrélé; combinaison non prouvée | contrat réussi | 69 jours-projet |
| node-releases | 2.0.55 | CANDIDATE Changement corrélé; combinaison non prouvée | contrat réussi | 2 jours-projet |
| update-browserslist-db | 1.2.3 | CANDIDATE Changement corrélé; combinaison non prouvée | contrat réussi | 1 jour-projet |
| update-browserslist-db | 1.3.2 | CANDIDATE Changement corrélé; combinaison non prouvée | contrat réussi | 68 jours-projet |
| update-browserslist-db | 1.3.3 | CANDIDATE Changement corrélé; combinaison non prouvée | contrat réussi | 2 jours-projet |
La colonne de mesure porte sur la version de chaque dépendance elle-même, pas sur la paire. Qu'un résolveur ait placé deux versions côte à côte ne prouve pas qu'elles fonctionnent ensemble.
Versions des dépendances au fil des versions
Ce vers quoi chaque version de ce paquet a résolu ses enfants. L'enfant dont la version a bougé vient en premier : c'est là qu'une mise à jour a changé quelque chose sous vos pieds.
| Bibliothèque | 4.29.0 | 4.28.9 | 4.28.8 | 4.28.7 | 4.28.1 |
|---|---|---|---|---|---|
| baseline-browser-mapping | 2.11.25 | 2.11.23 | 2.11.15 | 2.11.19 | 2.9.11 |
| caniuse-lite | 1.0.30001810 | 1.0.30001810 | 1.0.30001809 | 1.0.30001806 | 1.0.30001761 |
| electron-to-chromium | 1.5.432 | 1.5.427 | 1.5.414 | 1.5.415 | 1.5.267 |
| node-releases | 2.0.56 | 2.0.55 | 2.0.53 | 2.0.53 | 2.0.27 |
| update-browserslist-db | 1.3.3 | 1.2.3 | 1.3.0 | 1.3.1 | 1.2.3 |
Ont bougé : 5 · identiques à chaque version : 0
Une arête indique qu'un résolveur a placé une version à côté d'une autre sur une machine réelle. Ce n'est pas une affirmation qu'elles fonctionnent ensemble ; à cette question répondent les échantillons et les contrats, pas la présence d'une ligne.
Clusters d'échecs récents
-
observé UNKNOWN exit 1 ERR_MODULE_NOT_FOUND Lacune de preuve ×7 4.28.8 → 4.28.9 executionContext=node · os=linux · runtime=node@22.23 sha256:88af852f99a8…node:internal/modules/package_json_reader:<n> · throw new ERR_MODULE_NOT_FOUND(packageName, fileURLToPath(base), null); · ^ …node · unclassified-diagnostic · outer node · gap stage-unknownQualité de preuve: complete · Variantes d’environnement: 2 · Premier relevé: 2026-08-30 · Dernière observation: 2026-09-05Candidat à une revérification diagnostique
-
observé UNKNOWN exit 1 Lacune de preuve ×4 4.28.8 → 4.28.9 executionContext=node · moduleSystem=cjs · os=linux · runtime=node@22.23 sha256:91ad26545eb1…node:internal/modules/cjs/loader:<n> · throw err; · ^ · Error: Cannot find module <str>node · unclassified-diagnostic · outer node · gap stage-unknownQualité de preuve: complete · Variantes d’environnement: 1 · Premier relevé: 2026-08-31 · Dernière observation: 2026-09-05Candidat à une revérification diagnostique
-
observé PROCESS_START process start failed Lacune de preuve ×3 4.28.8 → 4.28.9 executionContext=node sha256:c12549970456…· structured-termination · gap diagnostic-missingQualité de preuve: partial · Variantes d’environnement: 2 · Premier relevé: 2026-09-05 · Dernière observation: 2026-09-16Candidat à une revérification diagnostique
-
observé UNKNOWN exit 1 Lacune de preuve ×2 4.28.8 → 4.28.9 executionContext=node · moduleSystem=esm · os=linux · runtime=node@22.23 sha256:455451e1a14e…<url>]:<n> · import babel from <str>; · ^^^^^ · SyntaxError: The requested module <str> does not provide an export named <str>node · unclassified-diagnostic · outer node · gap stage-unknownQualité de preuve: complete · Variantes d’environnement: 1 · Premier relevé: 2026-09-02 · Dernière observation: 2026-09-05Candidat à une revérification diagnostique
-
observé PROJECT_RESOLVE exit 1 ×1 4.28.9 executionContext=node · moduleSystem=cjs · os=linux · runtime=node@22.23 sha256:15e1b71df43a…test_contract.go:<n>:<n>: no required module provides package golang.org/x/text/unicode/norm: go.mod file not found in current directory or any parent …go/module · resolve-diagnostic · outer go runQualité de preuve: complete · Variantes d’environnement: 1 · Premier relevé: 2026-09-05 · Dernière observation: 2026-09-05
-
observé UNKNOWN exit 1 Lacune de preuve ×1 4.28.9 executionContext=node · moduleSystem=esm · os=linux · runtime=node@22.23 sha256:036052acb454…[eval]:<n> · const inst1 = plugin(api, { method: <str>, include: [<str>, <str>] }); · ^ · TypeError: plugin is not a functionnode · unclassified-diagnostic · outer node · gap stage-unknownQualité de preuve: complete · Variantes d’environnement: 1 · Premier relevé: 2026-09-05 · Dernière observation: 2026-09-05Candidat à une revérification diagnostique
-
observé UNKNOWN exit 1 Lacune de preuve ×1 4.28.9 executionContext=node · moduleSystem=cjs · os=linux · runtime=node@22.23 sha256:138a106a5937…stat main.go: no such file or directorygo · unclassified-diagnostic · outer go run · gap stage-unknownQualité de preuve: complete · Variantes d’environnement: 1 · Premier relevé: 2026-09-05 · Dernière observation: 2026-09-05Candidat à une revérification diagnostique
-
observé UNKNOWN exit 1 Lacune de preuve ×1 4.28.9 executionContext=node · moduleSystem=cjs · os=linux · runtime=node@22.23 sha256:69ab38336834…assertion 1 failed: expected text/plain; version=0.0.4; charset=utf-8, got text/plain; version=0.0.4; charset=utf-8; escaping=underscores · exit status 1go · unclassified-diagnostic · outer go run · gap stage-unknownQualité de preuve: complete · Variantes d’environnement: 1 · Premier relevé: 2026-09-05 · Dernière observation: 2026-09-05Candidat à une revérification diagnostique
-
observé UNKNOWN exit 1 ERR_ASSERTION Lacune de preuve ×1 4.28.9 executionContext=node · moduleSystem=cjs · os=linux · runtime=node@22.23 sha256:761ce8fa9777…node:assert:<n> · throw new AssertionError(obj); · ^ · AssertionError [ERR_ASSERTION]: Should yield 4 tokens for const answer = 42;node · unclassified-diagnostic · outer node · gap stage-unknownQualité de preuve: complete · Variantes d’environnement: 1 · Premier relevé: 2026-09-05 · Dernière observation: 2026-09-05Candidat à une revérification diagnostique
-
observé UNKNOWN exit 1 ERR_ASSERTION Lacune de preuve ×1 4.28.9 executionContext=node · moduleSystem=esm · os=linux · runtime=node@22.23 sha256:ac1a96fa941c…Contract test failed: AssertionError [ERR_ASSERTION]: out/preload/index.js must be created by build · at run (<url>) { · generatedMessage: false, …node · unclassified-diagnostic · outer node · gap stage-unknownQualité de preuve: complete · Variantes d’environnement: 1 · Premier relevé: 2026-09-06 · Dernière observation: 2026-09-06Candidat à une revérification diagnostique