Записиnpmbrowserslist4.28.9browserslist
Изменить условия
Текущие условия
browserslist @4.28.9debian glibc · x64 · node 22 · npm · node
1 из 1 прошли
Проверено — эта сеть выполнила контракт в этой координате.
образец есть — наш запуск в этой координате завершился чисто (1)
- Наблюдения в проектах
- 1 / 1
- Проверки контрактом
- 1 / 1
- Независимые сообщившие пиры
- 1
- Последняя запись
- 2026-09-17
Здоровье зависимостей
Наблюдаемые комбинации и свидетельства сбоев для этого выпуска
Первый обнаруженный сбой
4.28.9
linux · node@22.23 · executionContext=node
7 FAIL
· stage: UNKNOWN
· fingerprint: sha256:88af852f99a8104e4bc3c23eea27ebf2990625ccabf45313970f5fd7fe56c4e2
| Библиотека | Версия | Состояние | Измерено там | Проектов |
|---|---|---|---|---|
| baseline-browser-mapping | 2.11.21 | CANDIDATE Коррелированное изменение; комбинация не подтверждена | контракт пройден | 69 проектных дней |
| baseline-browser-mapping | 2.11.23 | CANDIDATE Коррелированное изменение; комбинация не подтверждена | сборки наблюдались | 2 проектных дня |
| caniuse-lite | 1.0.30001810 | CANDIDATE Коррелированное изменение; комбинация не подтверждена | контракт пройден | 71 проектный день |
| electron-to-chromium | 1.5.422 | CANDIDATE Коррелированное изменение; комбинация не подтверждена | контракт пройден | 69 проектных дней |
| electron-to-chromium | 1.5.427 | CANDIDATE Коррелированное изменение; комбинация не подтверждена | сборки наблюдались | 2 проектных дня |
| node-releases | 2.0.54 | CANDIDATE Коррелированное изменение; комбинация не подтверждена | контракт пройден | 69 проектных дней |
| node-releases | 2.0.55 | CANDIDATE Коррелированное изменение; комбинация не подтверждена | контракт пройден | 2 проектных дня |
| update-browserslist-db | 1.2.3 | CANDIDATE Коррелированное изменение; комбинация не подтверждена | контракт пройден | 1 проектный день |
| update-browserslist-db | 1.3.2 | CANDIDATE Коррелированное изменение; комбинация не подтверждена | контракт пройден | 68 проектных дней |
| update-browserslist-db | 1.3.3 | CANDIDATE Коррелированное изменение; комбинация не подтверждена | контракт пройден | 2 проектных дня |
Столбец измерения относится к релизу самой зависимости, а не к паре. То, что резолвер поставил два релиза рядом, не доказывает, что они работают вместе.
Версии зависимостей по выпускам
К чему каждый выпуск этого пакета разрешил своих потомков. Потомок, чья версия сдвинулась, идёт первым: там обновление изменило что-то под вами.
| Библиотека | 4.29.0 | 4.28.9 | 4.28.8 | 4.28.7 | 4.28.1 |
|---|---|---|---|---|---|
| baseline-browser-mapping | 2.11.25 | 2.11.23 | 2.11.15 | 2.11.19 | 2.9.11 |
| caniuse-lite | 1.0.30001810 | 1.0.30001810 | 1.0.30001809 | 1.0.30001806 | 1.0.30001761 |
| electron-to-chromium | 1.5.432 | 1.5.427 | 1.5.414 | 1.5.415 | 1.5.267 |
| node-releases | 2.0.56 | 2.0.55 | 2.0.53 | 2.0.53 | 2.0.27 |
| update-browserslist-db | 1.3.3 | 1.2.3 | 1.3.0 | 1.3.1 | 1.2.3 |
Сдвинулось: 5 · одинаково во всех выпусках: 0
Ребро фиксирует, что резолвер поставил один релиз рядом с другим на реальной машине. Это не утверждение, что они работают вместе; на этот вопрос отвечают образцы и контракты, а не наличие строки.
Недавние кластеры сбоев
-
наблюдалось UNKNOWN exit 1 ERR_MODULE_NOT_FOUND Пробел в данных ×7 4.28.8 → 4.28.9 executionContext=node · os=linux · runtime=node@22.23 sha256:88af852f99a8…node:internal/modules/package_json_reader:<n> · throw new ERR_MODULE_NOT_FOUND(packageName, fileURLToPath(base), null); · ^ …node · unclassified-diagnostic · outer node · gap stage-unknownКачество данных: complete · Варианты среды: 2 · Первая запись: 2026-08-30 · Последнее наблюдение: 2026-09-05Кандидат на диагностическую перепроверку
-
наблюдалось UNKNOWN exit 1 Пробел в данных ×4 4.28.8 → 4.28.9 executionContext=node · moduleSystem=cjs · os=linux · runtime=node@22.23 sha256:91ad26545eb1…node:internal/modules/cjs/loader:<n> · throw err; · ^ · Error: Cannot find module <str>node · unclassified-diagnostic · outer node · gap stage-unknownКачество данных: complete · Варианты среды: 1 · Первая запись: 2026-08-31 · Последнее наблюдение: 2026-09-05Кандидат на диагностическую перепроверку
-
наблюдалось PROCESS_START process start failed Пробел в данных ×3 4.28.8 → 4.28.9 executionContext=node sha256:c12549970456…· structured-termination · gap diagnostic-missingКачество данных: partial · Варианты среды: 2 · Первая запись: 2026-09-05 · Последнее наблюдение: 2026-09-16Кандидат на диагностическую перепроверку
-
наблюдалось UNKNOWN exit 1 Пробел в данных ×2 4.28.8 → 4.28.9 executionContext=node · moduleSystem=esm · os=linux · runtime=node@22.23 sha256:455451e1a14e…<url>]:<n> · import babel from <str>; · ^^^^^ · SyntaxError: The requested module <str> does not provide an export named <str>node · unclassified-diagnostic · outer node · gap stage-unknownКачество данных: complete · Варианты среды: 1 · Первая запись: 2026-09-02 · Последнее наблюдение: 2026-09-05Кандидат на диагностическую перепроверку
-
наблюдалось PROJECT_RESOLVE exit 1 ×1 4.28.9 executionContext=node · moduleSystem=cjs · os=linux · runtime=node@22.23 sha256:15e1b71df43a…test_contract.go:<n>:<n>: no required module provides package golang.org/x/text/unicode/norm: go.mod file not found in current directory or any parent …go/module · resolve-diagnostic · outer go runКачество данных: complete · Варианты среды: 1 · Первая запись: 2026-09-05 · Последнее наблюдение: 2026-09-05
-
наблюдалось UNKNOWN exit 1 Пробел в данных ×1 4.28.9 executionContext=node · moduleSystem=esm · os=linux · runtime=node@22.23 sha256:036052acb454…[eval]:<n> · const inst1 = plugin(api, { method: <str>, include: [<str>, <str>] }); · ^ · TypeError: plugin is not a functionnode · unclassified-diagnostic · outer node · gap stage-unknownКачество данных: complete · Варианты среды: 1 · Первая запись: 2026-09-05 · Последнее наблюдение: 2026-09-05Кандидат на диагностическую перепроверку
-
наблюдалось UNKNOWN exit 1 Пробел в данных ×1 4.28.9 executionContext=node · moduleSystem=cjs · os=linux · runtime=node@22.23 sha256:138a106a5937…stat main.go: no such file or directorygo · unclassified-diagnostic · outer go run · gap stage-unknownКачество данных: complete · Варианты среды: 1 · Первая запись: 2026-09-05 · Последнее наблюдение: 2026-09-05Кандидат на диагностическую перепроверку
-
наблюдалось UNKNOWN exit 1 Пробел в данных ×1 4.28.9 executionContext=node · moduleSystem=cjs · os=linux · runtime=node@22.23 sha256:69ab38336834…assertion 1 failed: expected text/plain; version=0.0.4; charset=utf-8, got text/plain; version=0.0.4; charset=utf-8; escaping=underscores · exit status 1go · unclassified-diagnostic · outer go run · gap stage-unknownКачество данных: complete · Варианты среды: 1 · Первая запись: 2026-09-05 · Последнее наблюдение: 2026-09-05Кандидат на диагностическую перепроверку
-
наблюдалось UNKNOWN exit 1 ERR_ASSERTION Пробел в данных ×1 4.28.9 executionContext=node · moduleSystem=cjs · os=linux · runtime=node@22.23 sha256:761ce8fa9777…node:assert:<n> · throw new AssertionError(obj); · ^ · AssertionError [ERR_ASSERTION]: Should yield 4 tokens for const answer = 42;node · unclassified-diagnostic · outer node · gap stage-unknownКачество данных: complete · Варианты среды: 1 · Первая запись: 2026-09-05 · Последнее наблюдение: 2026-09-05Кандидат на диагностическую перепроверку
-
наблюдалось UNKNOWN exit 1 ERR_ASSERTION Пробел в данных ×1 4.28.9 executionContext=node · moduleSystem=esm · os=linux · runtime=node@22.23 sha256:ac1a96fa941c…Contract test failed: AssertionError [ERR_ASSERTION]: out/preload/index.js must be created by build · at run (<url>) { · generatedMessage: false, …node · unclassified-diagnostic · outer node · gap stage-unknownКачество данных: complete · Варианты среды: 1 · Первая запись: 2026-09-06 · Последнее наблюдение: 2026-09-06Кандидат на диагностическую перепроверку