Recordsnpmbluebird3.7.2Promise.map
Change the conditions
Current conditions
Promise.map @3.7.2alpine musl · x64 · node 22 · npm · node
1 of 1 passed
Verified — this network ran a contract at this coordinate.
there is a sample here, and our run of it at this coordinate came back clean (2)
- Project observations
- nothing at this coordinate
- Contract verifications
- 1 / 1
- Last recorded
- 2026-08-26
Evidence you can open
Dependency Health
A resolution read this release's tree and found no dependencies. That is a measurement, not a missing one.
Recent failure clusters
-
observed UNKNOWN exit 1 Evidence gap ×6 3.7.2 executionContext=node · moduleSystem=cjs sha256:bc4d7ddc5bcd…node:internal/modules/cjs/loader:<n> · throw err; · ^ · Error: Cannot find module <str>npm · unclassified-diagnostic · outer npm run, npm test · gap stage-unknownEvidence quality: complete · Environment variants: 2 · First recorded: 2026-09-02 · Last seen: 2026-09-15Diagnostic re-verification candidate
-
observed UNKNOWN exit 1 Evidence gap ×1 3.7.2 executionContext=node · moduleSystem=esm · os=linux · runtime=node@22.23 sha256:795cbb5ee086…Error: Cannot find module <str> · Require stack: · - <path> · - <path>node · unclassified-diagnostic · outer node · gap stage-unknownEvidence quality: complete · Environment variants: 1 · First recorded: 2026-08-29 · Last seen: 2026-08-29Diagnostic re-verification candidate
-
observed UNKNOWN exit 1 ERR_ASSERTION Evidence gap ×1 3.7.2 executionContext=node · moduleSystem=cjs · os=linux · runtime=node@22.23 sha256:0d62cac8c07a…AssertionError [ERR_ASSERTION]: Expected values to be strictly equal: · + actual - expected · + <str> · - <str>node · unclassified-diagnostic · outer node · gap stage-unknownEvidence quality: complete · Environment variants: 1 · First recorded: 2026-08-30 · Last seen: 2026-08-30Diagnostic re-verification candidate
-
observed UNKNOWN exit 1 Evidence gap ×1 3.7.2 executionContext=node · moduleSystem=cjs · os=linux · runtime=node@22.23 sha256:e1d65fc7c136…<path>:<n> · throw new Error(`Unsupported arch ${name}`) · ^ · Error: Unsupported arch 1node · unclassified-diagnostic · outer node · gap stage-unknownEvidence quality: complete · Environment variants: 1 · First recorded: 2026-08-30 · Last seen: 2026-08-30Diagnostic re-verification candidate
-
observed UNKNOWN exit 1 ERR_ASSERTION Evidence gap ×1 3.7.2 executionContext=node · moduleSystem=cjs · os=linux · runtime=node@22.23 sha256:3ae85e0918b4…<path>:<n> · assert.strictEqual(toLinuxArchString(Arch.x64, false), <str>); · ^ · AssertionError [ERR_ASSERTION]: Expected values to be strictly equal:node · unclassified-diagnostic · outer node · gap stage-unknownEvidence quality: complete · Environment variants: 1 · First recorded: 2026-08-31 · Last seen: 2026-08-31Diagnostic re-verification candidate
-
observed UNKNOWN exit 1 ERR_ASSERTION Evidence gap ×1 3.7.2 executionContext=node · moduleSystem=esm · os=linux · runtime=node@22.23 sha256:986d98189e70…node:internal/modules/run_main:<n> · triggerUncaughtException( · ^ · AssertionError [ERR_ASSERTION]: Expected values to be strictly equal:node · unclassified-diagnostic · outer node · gap stage-unknownEvidence quality: complete · Environment variants: 1 · First recorded: 2026-08-31 · Last seen: 2026-08-31Diagnostic re-verification candidate
-
observed PROJECT_TEST exit 1 ×1 3.7.2 executionContext=node · moduleSystem=cjs · os=linux · runtime=node@22.23 sha256:3f00607211aa…Contract test failed: TypeError: Cannot read properties of undefined (reading <str>) · at run (<path>:<n>:<n>) …javascript/test-runner · test-runner-diagnostic · outer npm testEvidence quality: complete · Environment variants: 1 · First recorded: 2026-09-02 · Last seen: 2026-09-02
-
observed UNKNOWN exit 1 Evidence gap ×1 3.7.2 executionContext=node · moduleSystem=cjs · os=linux · runtime=node@22.23 sha256:bbf23c20e8d6…· unclassified-diagnostic · gap diagnostic-missingEvidence quality: partial · Environment variants: 1 · First recorded: 2026-09-02 · Last seen: 2026-09-02Diagnostic re-verification candidate