記録npmasync-exit-hook2.0.1async-exit-hook.hookedEvents
条件を変更
現在の条件
async-exit-hook.hookedEvents @2.0.1ubuntu glibc · x64 · node 22 · npm 10 · node
6 回中 0 回が成功
検証 — このネットワークがこの座標でコントラクトを実行しました。
サンプルあり — この座標で実行し、失敗した (1)
- プロジェクト観測
- 7 / 7
- コントラクト検証
- 0 / 6
- 独立した報告ピア
- 1
- 最終記録
- 2026-09-06
開ける証拠
依存関係のヘルス
ある解決処理がこのリリースのツリーを読み、依存関係はありませんでした。欠落ではなく測定結果です。
最近の失敗クラスター
-
観測済み UNKNOWN exit 1 証拠の欠落 ×6 2.0.1 executionContext=node · moduleSystem=cjs sha256:bc4d7ddc5bcd…node:internal/modules/cjs/loader:<n> · throw err; · ^ · Error: Cannot find module <str>npm · unclassified-diagnostic · outer npm run, npm test · gap stage-unknown証拠品質: complete · 環境バリアント: 2 · 初回記録: 2026-09-02 · 最終観測: 2026-09-14診断再検証候補
-
観測済み UNKNOWN exit 1 ERR_ASSERTION 証拠の欠落 ×4 2.0.1 executionContext=node · moduleSystem=cjs · os=linux · runtime=node@22.23 async-exit-hook.hookedEvents sha256:b478584d1c32…node:internal/modules/run_main:<n> · triggerUncaughtException( · ^ …node · unclassified-diagnostic · outer node · gap stage-unknown証拠品質: complete · 環境バリアント: 1 · 初回記録: 2026-09-06 · 最終観測: 2026-09-06診断再検証候補
-
観測済み UNKNOWN exit 1 ERR_ASSERTION 証拠の欠落 ×2 2.0.1 executionContext=node · moduleSystem=cjs · os=linux · runtime=node@22.23 async-exit-hook.hookedEvents sha256:92a8bc4d9117…node:internal/modules/run_main:<n> · triggerUncaughtException( · ^ · AssertionError [ERR_ASSERTION]: Hook should not run for ignored eventnode · unclassified-diagnostic · outer node · gap stage-unknown証拠品質: complete · 環境バリアント: 1 · 初回記録: 2026-09-06 · 最終観測: 2026-09-06診断再検証候補
-
観測済み UNKNOWN exit 1 ERR_ASSERTION 証拠の欠落 ×1 2.0.1 executionContext=node · moduleSystem=cjs · os=linux · runtime=node@22.23 sha256:986d98189e70…node:internal/modules/run_main:<n> · triggerUncaughtException( · ^ · AssertionError [ERR_ASSERTION]: Expected values to be strictly equal:node · unclassified-diagnostic · outer node · gap stage-unknown証拠品質: complete · 環境バリアント: 1 · 初回記録: 2026-08-29 · 最終観測: 2026-08-29診断再検証候補
-
観測済み UNKNOWN exit 1 証拠の欠落 ×1 2.0.1 executionContext=node · moduleSystem=esm · os=linux · runtime=node@22.23 sha256:795cbb5ee086…Error: Cannot find module <str> · Require stack: · - <path> · - <path>node · unclassified-diagnostic · outer node · gap stage-unknown証拠品質: complete · 環境バリアント: 1 · 初回記録: 2026-08-29 · 最終観測: 2026-08-29診断再検証候補
-
観測済み UNKNOWN exit 1 証拠の欠落 ×1 2.0.1 executionContext=node · moduleSystem=cjs · os=linux · runtime=node@22.23 sha256:0c06875294a4…Contract test failed: TypeError: Cannot read properties of undefined (reading <str>) · at runContract (<url>) …node · unclassified-diagnostic · outer node · gap stage-unknown証拠品質: complete · 環境バリアント: 1 · 初回記録: 2026-08-30 · 最終観測: 2026-08-30診断再検証候補
-
観測済み UNKNOWN exit 1 ERR_ASSERTION 証拠の欠落 ×1 2.0.1 executionContext=node · moduleSystem=cjs · os=linux · runtime=node@22.23 sha256:0d62cac8c07a…AssertionError [ERR_ASSERTION]: Expected values to be strictly equal: · + actual - expected · + <str> · - <str>node · unclassified-diagnostic · outer node · gap stage-unknown証拠品質: complete · 環境バリアント: 1 · 初回記録: 2026-08-30 · 最終観測: 2026-08-30診断再検証候補
-
観測済み UNKNOWN exit 1 ERR_ASSERTION 証拠の欠落 ×1 2.0.1 executionContext=node · moduleSystem=cjs · os=linux · runtime=node@22.23 sha256:6add120cf65b…Contract test failed: AssertionError [ERR_ASSERTION]: Disposer callback should be called during cleanup · false !== true · at runContract (<url>) { …node · unclassified-diagnostic · outer node · gap stage-unknown証拠品質: complete · 環境バリアント: 1 · 初回記録: 2026-08-30 · 最終観測: 2026-08-30診断再検証候補
-
観測済み UNKNOWN exit 1 証拠の欠落 ×1 2.0.1 executionContext=node · moduleSystem=cjs · os=linux · runtime=node@22.23 sha256:9630b514e713…Contract test failed: TypeError: this.terminate is not a function · at ProgressBar.set currentAmount [as currentAmount] <path>:<n>:<n>) …node · unclassified-diagnostic · outer node · gap stage-unknown証拠品質: complete · 環境バリアント: 1 · 初回記録: 2026-08-30 · 最終観測: 2026-08-30診断再検証候補
-
観測済み UNKNOWN exit 1 ERR_ASSERTION 証拠の欠落 ×1 2.0.1 executionContext=node · moduleSystem=cjs · os=linux · runtime=node@22.23 sha256:9ed50b51742b…Contract test failed: AssertionError [ERR_ASSERTION]: Expected values to be strictly equal: · 0 !== 50 · at runContract (<url>) …node · unclassified-diagnostic · outer node · gap stage-unknown証拠品質: complete · 環境バリアント: 1 · 初回記録: 2026-08-30 · 最終観測: 2026-08-30診断再検証候補
-
観測済み UNKNOWN exit 1 証拠の欠落 ×1 2.0.1 executionContext=node · moduleSystem=cjs · os=linux · runtime=node@22.23 sha256:a592ca8c2930…Contract test failed: TypeError: this.stream.moveCursor is not a function · at MultiProgress.allocateLines <path>:<n>:<n>) …node · unclassified-diagnostic · outer node · gap stage-unknown証拠品質: complete · 環境バリアント: 1 · 初回記録: 2026-08-30 · 最終観測: 2026-08-30診断再検証候補
-
観測済み UNKNOWN exit 1 証拠の欠落 ×1 2.0.1 executionContext=node · moduleSystem=cjs · os=linux · runtime=node@22.23 sha256:e1d65fc7c136…<path>:<n> · throw new Error(`Unsupported arch ${name}`) · ^ · Error: Unsupported arch 1node · unclassified-diagnostic · outer node · gap stage-unknown証拠品質: complete · 環境バリアント: 1 · 初回記録: 2026-08-30 · 最終観測: 2026-08-30診断再検証候補
最も多く報告された 12 件を表示しています。この座標に記録された失敗クラスタは 15 件です。残りは単発の報告です。