Registrosnpmasync-exit-hook2.0.1async-exit-hook.hookedEvents
Cambiar las condiciones
Condiciones actuales
async-exit-hook.hookedEvents @2.0.1ubuntu glibc · x64 · node 22 · npm 10 · node
0 de 6 pasaron
Verificado: esta red ejecutó un contrato en esta coordenada.
hay una muestra aquí y nuestra ejecución en esta coordenada falló (1)
- Observaciones de proyectos
- 7 / 7
- Verificaciones de contrato
- 0 / 6
- Peers independientes que reportaron
- 1
- Último registro
- 2026-09-06
Evidencia que puedes abrir
Salud de dependencias
Una resolución leyó el árbol de esta versión y no encontró dependencias. Es una medición, no una que falte.
Clústeres de fallos recientes
-
observado UNKNOWN exit 1 Brecha de evidencia ×6 2.0.1 executionContext=node · moduleSystem=cjs sha256:bc4d7ddc5bcd…node:internal/modules/cjs/loader:<n> · throw err; · ^ · Error: Cannot find module <str>npm · unclassified-diagnostic · outer npm run, npm test · gap stage-unknownCalidad de evidencia: complete · Variantes de entorno: 2 · Primer registro: 2026-09-02 · Última observación: 2026-09-14Candidato a reverificación diagnóstica
-
observado UNKNOWN exit 1 ERR_ASSERTION Brecha de evidencia ×4 2.0.1 executionContext=node · moduleSystem=cjs · os=linux · runtime=node@22.23 async-exit-hook.hookedEvents sha256:b478584d1c32…node:internal/modules/run_main:<n> · triggerUncaughtException( · ^ …node · unclassified-diagnostic · outer node · gap stage-unknownCalidad de evidencia: complete · Variantes de entorno: 1 · Primer registro: 2026-09-06 · Última observación: 2026-09-06Candidato a reverificación diagnóstica
-
observado UNKNOWN exit 1 ERR_ASSERTION Brecha de evidencia ×2 2.0.1 executionContext=node · moduleSystem=cjs · os=linux · runtime=node@22.23 async-exit-hook.hookedEvents sha256:92a8bc4d9117…node:internal/modules/run_main:<n> · triggerUncaughtException( · ^ · AssertionError [ERR_ASSERTION]: Hook should not run for ignored eventnode · unclassified-diagnostic · outer node · gap stage-unknownCalidad de evidencia: complete · Variantes de entorno: 1 · Primer registro: 2026-09-06 · Última observación: 2026-09-06Candidato a reverificación diagnóstica
-
observado UNKNOWN exit 1 ERR_ASSERTION Brecha de evidencia ×1 2.0.1 executionContext=node · moduleSystem=cjs · os=linux · runtime=node@22.23 sha256:986d98189e70…node:internal/modules/run_main:<n> · triggerUncaughtException( · ^ · AssertionError [ERR_ASSERTION]: Expected values to be strictly equal:node · unclassified-diagnostic · outer node · gap stage-unknownCalidad de evidencia: complete · Variantes de entorno: 1 · Primer registro: 2026-08-29 · Última observación: 2026-08-29Candidato a reverificación diagnóstica
-
observado UNKNOWN exit 1 Brecha de evidencia ×1 2.0.1 executionContext=node · moduleSystem=esm · os=linux · runtime=node@22.23 sha256:795cbb5ee086…Error: Cannot find module <str> · Require stack: · - <path> · - <path>node · unclassified-diagnostic · outer node · gap stage-unknownCalidad de evidencia: complete · Variantes de entorno: 1 · Primer registro: 2026-08-29 · Última observación: 2026-08-29Candidato a reverificación diagnóstica
-
observado UNKNOWN exit 1 Brecha de evidencia ×1 2.0.1 executionContext=node · moduleSystem=cjs · os=linux · runtime=node@22.23 sha256:0c06875294a4…Contract test failed: TypeError: Cannot read properties of undefined (reading <str>) · at runContract (<url>) …node · unclassified-diagnostic · outer node · gap stage-unknownCalidad de evidencia: complete · Variantes de entorno: 1 · Primer registro: 2026-08-30 · Última observación: 2026-08-30Candidato a reverificación diagnóstica
-
observado UNKNOWN exit 1 ERR_ASSERTION Brecha de evidencia ×1 2.0.1 executionContext=node · moduleSystem=cjs · os=linux · runtime=node@22.23 sha256:0d62cac8c07a…AssertionError [ERR_ASSERTION]: Expected values to be strictly equal: · + actual - expected · + <str> · - <str>node · unclassified-diagnostic · outer node · gap stage-unknownCalidad de evidencia: complete · Variantes de entorno: 1 · Primer registro: 2026-08-30 · Última observación: 2026-08-30Candidato a reverificación diagnóstica
-
observado UNKNOWN exit 1 ERR_ASSERTION Brecha de evidencia ×1 2.0.1 executionContext=node · moduleSystem=cjs · os=linux · runtime=node@22.23 sha256:6add120cf65b…Contract test failed: AssertionError [ERR_ASSERTION]: Disposer callback should be called during cleanup · false !== true · at runContract (<url>) { …node · unclassified-diagnostic · outer node · gap stage-unknownCalidad de evidencia: complete · Variantes de entorno: 1 · Primer registro: 2026-08-30 · Última observación: 2026-08-30Candidato a reverificación diagnóstica
-
observado UNKNOWN exit 1 Brecha de evidencia ×1 2.0.1 executionContext=node · moduleSystem=cjs · os=linux · runtime=node@22.23 sha256:9630b514e713…Contract test failed: TypeError: this.terminate is not a function · at ProgressBar.set currentAmount [as currentAmount] <path>:<n>:<n>) …node · unclassified-diagnostic · outer node · gap stage-unknownCalidad de evidencia: complete · Variantes de entorno: 1 · Primer registro: 2026-08-30 · Última observación: 2026-08-30Candidato a reverificación diagnóstica
-
observado UNKNOWN exit 1 ERR_ASSERTION Brecha de evidencia ×1 2.0.1 executionContext=node · moduleSystem=cjs · os=linux · runtime=node@22.23 sha256:9ed50b51742b…Contract test failed: AssertionError [ERR_ASSERTION]: Expected values to be strictly equal: · 0 !== 50 · at runContract (<url>) …node · unclassified-diagnostic · outer node · gap stage-unknownCalidad de evidencia: complete · Variantes de entorno: 1 · Primer registro: 2026-08-30 · Última observación: 2026-08-30Candidato a reverificación diagnóstica
-
observado UNKNOWN exit 1 Brecha de evidencia ×1 2.0.1 executionContext=node · moduleSystem=cjs · os=linux · runtime=node@22.23 sha256:a592ca8c2930…Contract test failed: TypeError: this.stream.moveCursor is not a function · at MultiProgress.allocateLines <path>:<n>:<n>) …node · unclassified-diagnostic · outer node · gap stage-unknownCalidad de evidencia: complete · Variantes de entorno: 1 · Primer registro: 2026-08-30 · Última observación: 2026-08-30Candidato a reverificación diagnóstica
-
observado UNKNOWN exit 1 Brecha de evidencia ×1 2.0.1 executionContext=node · moduleSystem=cjs · os=linux · runtime=node@22.23 sha256:e1d65fc7c136…<path>:<n> · throw new Error(`Unsupported arch ${name}`) · ^ · Error: Unsupported arch 1node · unclassified-diagnostic · outer node · gap stage-unknownCalidad de evidencia: complete · Variantes de entorno: 1 · Primer registro: 2026-08-30 · Última observación: 2026-08-30Candidato a reverificación diagnóstica
Se muestran los 12 más reportados de 15 grupos de fallos registrados. El resto son reportes únicos.