Recordsnpmasync-exit-hook2.0.1async-exit-hook.hookedEvents
Change the conditions
Current conditions
async-exit-hook.hookedEvents @2.0.1ubuntu glibc · x64 · node 22 · npm 10 · node
0 of 6 passed
Verified — this network ran a contract at this coordinate.
there is a sample here, and our run of it at this coordinate failed (1)
- Project observations
- 7 / 7
- Contract verifications
- 0 / 6
- Independent reporting peers
- 1
- Last recorded
- 2026-09-06
Evidence you can open
Dependency Health
A resolution read this release's tree and found no dependencies. That is a measurement, not a missing one.
Recent failure clusters
-
observed UNKNOWN exit 1 Evidence gap ×6 2.0.1 executionContext=node · moduleSystem=cjs sha256:bc4d7ddc5bcd…node:internal/modules/cjs/loader:<n> · throw err; · ^ · Error: Cannot find module <str>npm · unclassified-diagnostic · outer npm run, npm test · gap stage-unknownEvidence quality: complete · Environment variants: 2 · First recorded: 2026-09-02 · Last seen: 2026-09-14Diagnostic re-verification candidate
-
observed UNKNOWN exit 1 ERR_ASSERTION Evidence gap ×4 2.0.1 executionContext=node · moduleSystem=cjs · os=linux · runtime=node@22.23 async-exit-hook.hookedEvents sha256:b478584d1c32…node:internal/modules/run_main:<n> · triggerUncaughtException( · ^ …node · unclassified-diagnostic · outer node · gap stage-unknownEvidence quality: complete · Environment variants: 1 · First recorded: 2026-09-06 · Last seen: 2026-09-06Diagnostic re-verification candidate
-
observed UNKNOWN exit 1 ERR_ASSERTION Evidence gap ×2 2.0.1 executionContext=node · moduleSystem=cjs · os=linux · runtime=node@22.23 async-exit-hook.hookedEvents sha256:92a8bc4d9117…node:internal/modules/run_main:<n> · triggerUncaughtException( · ^ · AssertionError [ERR_ASSERTION]: Hook should not run for ignored eventnode · unclassified-diagnostic · outer node · gap stage-unknownEvidence quality: complete · Environment variants: 1 · First recorded: 2026-09-06 · Last seen: 2026-09-06Diagnostic re-verification candidate
-
observed UNKNOWN exit 1 ERR_ASSERTION Evidence gap ×1 2.0.1 executionContext=node · moduleSystem=cjs · os=linux · runtime=node@22.23 sha256:986d98189e70…node:internal/modules/run_main:<n> · triggerUncaughtException( · ^ · AssertionError [ERR_ASSERTION]: Expected values to be strictly equal:node · unclassified-diagnostic · outer node · gap stage-unknownEvidence quality: complete · Environment variants: 1 · First recorded: 2026-08-29 · Last seen: 2026-08-29Diagnostic re-verification candidate
-
observed UNKNOWN exit 1 Evidence gap ×1 2.0.1 executionContext=node · moduleSystem=esm · os=linux · runtime=node@22.23 sha256:795cbb5ee086…Error: Cannot find module <str> · Require stack: · - <path> · - <path>node · unclassified-diagnostic · outer node · gap stage-unknownEvidence quality: complete · Environment variants: 1 · First recorded: 2026-08-29 · Last seen: 2026-08-29Diagnostic re-verification candidate
-
observed UNKNOWN exit 1 Evidence gap ×1 2.0.1 executionContext=node · moduleSystem=cjs · os=linux · runtime=node@22.23 sha256:0c06875294a4…Contract test failed: TypeError: Cannot read properties of undefined (reading <str>) · at runContract (<url>) …node · unclassified-diagnostic · outer node · gap stage-unknownEvidence quality: complete · Environment variants: 1 · First recorded: 2026-08-30 · Last seen: 2026-08-30Diagnostic re-verification candidate
-
observed UNKNOWN exit 1 ERR_ASSERTION Evidence gap ×1 2.0.1 executionContext=node · moduleSystem=cjs · os=linux · runtime=node@22.23 sha256:0d62cac8c07a…AssertionError [ERR_ASSERTION]: Expected values to be strictly equal: · + actual - expected · + <str> · - <str>node · unclassified-diagnostic · outer node · gap stage-unknownEvidence quality: complete · Environment variants: 1 · First recorded: 2026-08-30 · Last seen: 2026-08-30Diagnostic re-verification candidate
-
observed UNKNOWN exit 1 ERR_ASSERTION Evidence gap ×1 2.0.1 executionContext=node · moduleSystem=cjs · os=linux · runtime=node@22.23 sha256:6add120cf65b…Contract test failed: AssertionError [ERR_ASSERTION]: Disposer callback should be called during cleanup · false !== true · at runContract (<url>) { …node · unclassified-diagnostic · outer node · gap stage-unknownEvidence quality: complete · Environment variants: 1 · First recorded: 2026-08-30 · Last seen: 2026-08-30Diagnostic re-verification candidate
-
observed UNKNOWN exit 1 Evidence gap ×1 2.0.1 executionContext=node · moduleSystem=cjs · os=linux · runtime=node@22.23 sha256:9630b514e713…Contract test failed: TypeError: this.terminate is not a function · at ProgressBar.set currentAmount [as currentAmount] <path>:<n>:<n>) …node · unclassified-diagnostic · outer node · gap stage-unknownEvidence quality: complete · Environment variants: 1 · First recorded: 2026-08-30 · Last seen: 2026-08-30Diagnostic re-verification candidate
-
observed UNKNOWN exit 1 ERR_ASSERTION Evidence gap ×1 2.0.1 executionContext=node · moduleSystem=cjs · os=linux · runtime=node@22.23 sha256:9ed50b51742b…Contract test failed: AssertionError [ERR_ASSERTION]: Expected values to be strictly equal: · 0 !== 50 · at runContract (<url>) …node · unclassified-diagnostic · outer node · gap stage-unknownEvidence quality: complete · Environment variants: 1 · First recorded: 2026-08-30 · Last seen: 2026-08-30Diagnostic re-verification candidate
-
observed UNKNOWN exit 1 Evidence gap ×1 2.0.1 executionContext=node · moduleSystem=cjs · os=linux · runtime=node@22.23 sha256:a592ca8c2930…Contract test failed: TypeError: this.stream.moveCursor is not a function · at MultiProgress.allocateLines <path>:<n>:<n>) …node · unclassified-diagnostic · outer node · gap stage-unknownEvidence quality: complete · Environment variants: 1 · First recorded: 2026-08-30 · Last seen: 2026-08-30Diagnostic re-verification candidate
-
observed UNKNOWN exit 1 Evidence gap ×1 2.0.1 executionContext=node · moduleSystem=cjs · os=linux · runtime=node@22.23 sha256:e1d65fc7c136…<path>:<n> · throw new Error(`Unsupported arch ${name}`) · ^ · Error: Unsupported arch 1node · unclassified-diagnostic · outer node · gap stage-unknownEvidence quality: complete · Environment variants: 1 · First recorded: 2026-08-30 · Last seen: 2026-08-30Diagnostic re-verification candidate
Showing the 12 most-reported of 15 recorded failure clusters. The rest are single reports.