Registrosnpmasync-exit-hook2.0.1async-exit-hook.uncaughtExceptionHandler
Mudar as condições
Condições atuais
async-exit-hook.uncaughtExceptionHandler @2.0.1ubuntu glibc · x64 · node 22 · npm 10 · node
6 de 6 passaram
Observado — builds reais de projetos reportaram desta coordenada.
há uma amostra aqui e ainda não a executamos nesta coordenada (2)
- Observações de projetos
- 6 / 6
- Verificações de contrato
- nada nesta coordenada
- Peers independentes que reportaram
- 1
- Último registro
- 2026-08-30
Evidências que você pode abrir
Saúde das dependências
Uma resolução leu a árvore desta versão e não encontrou dependências. Isso é uma medição, não uma medição ausente.
Clusters de falha recentes
-
observado UNKNOWN exit 1 Lacuna de evidência ×6 2.0.1 executionContext=node · moduleSystem=cjs sha256:bc4d7ddc5bcd…node:internal/modules/cjs/loader:<n> · throw err; · ^ · Error: Cannot find module <str>npm · unclassified-diagnostic · outer npm run, npm test · gap stage-unknownQualidade da evidência: complete · Variantes de ambiente: 2 · Primeiro registro: 2026-09-02 · Visto por último: 2026-09-14Candidato a reverificação diagnóstica
-
observado UNKNOWN exit 1 ERR_ASSERTION Lacuna de evidência ×2 2.0.1 executionContext=node · moduleSystem=cjs · os=linux · runtime=node@22.23 sha256:b478584d1c32…node:internal/modules/run_main:<n> · triggerUncaughtException( · ^ …node · unclassified-diagnostic · outer node · gap stage-unknownQualidade da evidência: complete · Variantes de ambiente: 1 · Primeiro registro: 2026-09-06 · Visto por último: 2026-09-06Candidato a reverificação diagnóstica
-
observado UNKNOWN exit 1 ERR_ASSERTION Lacuna de evidência ×1 2.0.1 executionContext=node · moduleSystem=cjs · os=linux · runtime=node@22.23 sha256:986d98189e70…node:internal/modules/run_main:<n> · triggerUncaughtException( · ^ · AssertionError [ERR_ASSERTION]: Expected values to be strictly equal:node · unclassified-diagnostic · outer node · gap stage-unknownQualidade da evidência: complete · Variantes de ambiente: 1 · Primeiro registro: 2026-08-29 · Visto por último: 2026-08-29Candidato a reverificação diagnóstica
-
observado UNKNOWN exit 1 Lacuna de evidência ×1 2.0.1 executionContext=node · moduleSystem=esm · os=linux · runtime=node@22.23 sha256:795cbb5ee086…Error: Cannot find module <str> · Require stack: · - <path> · - <path>node · unclassified-diagnostic · outer node · gap stage-unknownQualidade da evidência: complete · Variantes de ambiente: 1 · Primeiro registro: 2026-08-29 · Visto por último: 2026-08-29Candidato a reverificação diagnóstica
-
observado UNKNOWN exit 1 Lacuna de evidência ×1 2.0.1 executionContext=node · moduleSystem=cjs · os=linux · runtime=node@22.23 sha256:0c06875294a4…Contract test failed: TypeError: Cannot read properties of undefined (reading <str>) · at runContract (<url>) …node · unclassified-diagnostic · outer node · gap stage-unknownQualidade da evidência: complete · Variantes de ambiente: 1 · Primeiro registro: 2026-08-30 · Visto por último: 2026-08-30Candidato a reverificação diagnóstica
-
observado UNKNOWN exit 1 ERR_ASSERTION Lacuna de evidência ×1 2.0.1 executionContext=node · moduleSystem=cjs · os=linux · runtime=node@22.23 sha256:0d62cac8c07a…AssertionError [ERR_ASSERTION]: Expected values to be strictly equal: · + actual - expected · + <str> · - <str>node · unclassified-diagnostic · outer node · gap stage-unknownQualidade da evidência: complete · Variantes de ambiente: 1 · Primeiro registro: 2026-08-30 · Visto por último: 2026-08-30Candidato a reverificação diagnóstica
-
observado UNKNOWN exit 1 ERR_ASSERTION Lacuna de evidência ×1 2.0.1 executionContext=node · moduleSystem=cjs · os=linux · runtime=node@22.23 sha256:6add120cf65b…Contract test failed: AssertionError [ERR_ASSERTION]: Disposer callback should be called during cleanup · false !== true · at runContract (<url>) { …node · unclassified-diagnostic · outer node · gap stage-unknownQualidade da evidência: complete · Variantes de ambiente: 1 · Primeiro registro: 2026-08-30 · Visto por último: 2026-08-30Candidato a reverificação diagnóstica
-
observado UNKNOWN exit 1 Lacuna de evidência ×1 2.0.1 executionContext=node · moduleSystem=cjs · os=linux · runtime=node@22.23 sha256:9630b514e713…Contract test failed: TypeError: this.terminate is not a function · at ProgressBar.set currentAmount [as currentAmount] <path>:<n>:<n>) …node · unclassified-diagnostic · outer node · gap stage-unknownQualidade da evidência: complete · Variantes de ambiente: 1 · Primeiro registro: 2026-08-30 · Visto por último: 2026-08-30Candidato a reverificação diagnóstica
-
observado UNKNOWN exit 1 ERR_ASSERTION Lacuna de evidência ×1 2.0.1 executionContext=node · moduleSystem=cjs · os=linux · runtime=node@22.23 sha256:9ed50b51742b…Contract test failed: AssertionError [ERR_ASSERTION]: Expected values to be strictly equal: · 0 !== 50 · at runContract (<url>) …node · unclassified-diagnostic · outer node · gap stage-unknownQualidade da evidência: complete · Variantes de ambiente: 1 · Primeiro registro: 2026-08-30 · Visto por último: 2026-08-30Candidato a reverificação diagnóstica
-
observado UNKNOWN exit 1 Lacuna de evidência ×1 2.0.1 executionContext=node · moduleSystem=cjs · os=linux · runtime=node@22.23 sha256:a592ca8c2930…Contract test failed: TypeError: this.stream.moveCursor is not a function · at MultiProgress.allocateLines <path>:<n>:<n>) …node · unclassified-diagnostic · outer node · gap stage-unknownQualidade da evidência: complete · Variantes de ambiente: 1 · Primeiro registro: 2026-08-30 · Visto por último: 2026-08-30Candidato a reverificação diagnóstica
-
observado UNKNOWN exit 1 Lacuna de evidência ×1 2.0.1 executionContext=node · moduleSystem=cjs · os=linux · runtime=node@22.23 sha256:e1d65fc7c136…<path>:<n> · throw new Error(`Unsupported arch ${name}`) · ^ · Error: Unsupported arch 1node · unclassified-diagnostic · outer node · gap stage-unknownQualidade da evidência: complete · Variantes de ambiente: 1 · Primeiro registro: 2026-08-30 · Visto por último: 2026-08-30Candidato a reverificação diagnóstica
-
observado UNKNOWN exit 1 ERR_ASSERTION Lacuna de evidência ×1 2.0.1 executionContext=node · moduleSystem=cjs · os=linux · runtime=node@22.23 sha256:3ae85e0918b4…<path>:<n> · assert.strictEqual(toLinuxArchString(Arch.x64, false), <str>); · ^ · AssertionError [ERR_ASSERTION]: Expected values to be strictly equal:node · unclassified-diagnostic · outer node · gap stage-unknownQualidade da evidência: complete · Variantes de ambiente: 1 · Primeiro registro: 2026-08-31 · Visto por último: 2026-08-31Candidato a reverificação diagnóstica
Mostrando os 12 mais relatados de 15 grupos de falhas registrados. O resto são relatos únicos.