记录npmassertion-error2.0.1assertion-error.AssertionError
更改条件
依赖健康度
某次解析读取了该版本的依赖树,没有发现依赖。这是一次测量结果,而不是缺失。
近期失败聚类
-
已观测 PROCESS_START process start failed 证据缺口 ×14 2.0.1 executionContext=node sha256:c12549970456…· structured-termination · gap diagnostic-missing证据质量: partial · 环境变体: 3 · 首次记录: 2026-08-31 · 最近观测: 2026-09-16诊断复验候选
-
已观测 PROJECT_PROCESS ERR_ASSERTION 证据缺口 ×5 2.0.1 executionContext=node · moduleSystem=esm证据质量: legacy-evidence-incomplete · 环境变体: 2 · 首次记录: 2026-08-14 · 最近观测: 2026-08-30诊断复验候选
-
已观测 UNKNOWN exit 1 证据缺口 ×3 2.0.1 executionContext=node · moduleSystem=esm · os=linux · runtime=node@22.23 sha256:8fd30f2a6304…fil<path>:<n> · throw new Error(errorMsg); · ^ · Error: Vitest failed to access its internal state.node · unclassified-diagnostic · outer node · gap stage-unknown证据质量: complete · 环境变体: 1 · 首次记录: 2026-08-31 · 最近观测: 2026-09-08诊断复验候选
-
已观测 UNKNOWN exit 1 证据缺口 ×2 2.0.1 executionContext=node · moduleSystem=esm · os=linux · runtime=node@22.23 sha256:42623a56826f…fil<path>:<n> · Object.defineProperty(expect.not, expectAssertionName, { · ^ · TypeError: Object.defineProperty called on non-objectnode · unclassified-diagnostic · outer node · gap stage-unknown证据质量: complete · 环境变体: 1 · 首次记录: 2026-09-03 · 最近观测: 2026-09-04诊断复验候选
-
已观测 UNKNOWN exit 1 证据缺口 ×2 2.0.1 executionContext=node · moduleSystem=cjs · os=linux · runtime=node@22.23 sha256:3b3190f2cd44…doc: cannot find package <str> in any of: · ($GOROOT not set) · <path> (from $GOPATH)go · unclassified-diagnostic · outer go · gap stage-unknown证据质量: complete · 环境变体: 1 · 首次记录: 2026-09-04 · 最近观测: 2026-09-04诊断复验候选
-
已观测 UNKNOWN exit 1 证据缺口 ×2 2.0.1 executionContext=node · moduleSystem=cjs · os=linux · runtime=node@22.23 sha256:f0288eb0529f…Traceback (most recent call last): · File <str>, line 19, in <module> · AssertionError· unclassified-diagnostic · gap stage-unknown证据质量: complete · 环境变体: 1 · 首次记录: 2026-09-04 · 最近观测: 2026-09-04诊断复验候选
-
已观测 UNKNOWN exit 1 证据缺口 ×1 2.0.1 executionContext=node · moduleSystem=esm · os=linux · runtime=node@22.23 sha256:994722463fe8…fil<path>:<n> · throw Error( · ^ · Error: Invalid Chai property: toSatisfy. Did you mean <str>?node · unclassified-diagnostic · outer node · gap stage-unknown证据质量: complete · 环境变体: 1 · 首次记录: 2026-08-31 · 最近观测: 2026-08-31诊断复验候选
-
已观测 PROJECT_TEST exit 1 ERR_LOAD_URL ×1 2.0.1 executionContext=node · moduleSystem=esm · os=linux · runtime=node@22.23 sha256:a60e7101af87…Contract test failed: Error: Failed to load custom Reporter from basic · at loadCustomReporterModule (fil<path>:<n>:<n>) · at fil<path>:<n>:<n> …javascript/test-runner · test-runner-diagnostic · outer npm test证据质量: complete · 环境变体: 1 · 首次记录: 2026-08-31 · 最近观测: 2026-08-31
-
已观测 UNKNOWN exit 1 证据缺口 ×1 2.0.1 executionContext=node · moduleSystem=cjs · os=linux · runtime=node@22.23 sha256:72ba2d1e946f…<path>: No module named pippython3 · unclassified-diagnostic · outer python3 · gap stage-unknown证据质量: complete · 环境变体: 1 · 首次记录: 2026-08-31 · 最近观测: 2026-08-31诊断复验候选
-
已观测 UNKNOWN exit 1 证据缺口 ×1 2.0.1 executionContext=node · moduleSystem=cjs · os=linux · runtime=node@22.23 sha256:91ad26545eb1…node:internal/modules/cjs/loader:<n> · throw err; · ^ · Error: Cannot find module <str>node · unclassified-diagnostic · outer node · gap stage-unknown证据质量: complete · 环境变体: 1 · 首次记录: 2026-08-31 · 最近观测: 2026-08-31诊断复验候选
-
已观测 UNKNOWN exit 1 证据缺口 ×1 2.0.1 executionContext=node · moduleSystem=cjs · os=linux · runtime=node@22.23 sha256:d7f5d491441c…Traceback (most recent call last): · File <str>, line 71, in <module> · AssertionError: is_annotated must return True for Annotated· unclassified-diagnostic · gap stage-unknown证据质量: complete · 环境变体: 1 · 首次记录: 2026-08-31 · 最近观测: 2026-08-31诊断复验候选
-
已观测 UNKNOWN exit 1 证据缺口 ×1 2.0.1 executionContext=node · moduleSystem=esm · os=linux · runtime=node@22.23 sha256:67b21c7b2753…Contract test failed: TypeError: Cannot assign to read only property <str> of function 'class Assertion { · constructor(obj) { · this._obj = obj; · }node · unclassified-diagnostic · outer node · gap stage-unknown证据质量: complete · 环境变体: 1 · 首次记录: 2026-09-03 · 最近观测: 2026-09-03诊断复验候选
显示报告最多的 12 个。此坐标记录的失败聚类共 23 个。其余为单次报告。