记录npmansi-escapes4.3.2ansiEscapes.cursorTo
更改条件
依赖健康度
此版本的依赖组合与失败观测
观测到问题 1 项 ·
正常 1 项
测量列说的是每个依赖自身版本的情况,而不是这一对的情况。解析器把两个版本放在一起,并不证明它们能协同工作。
各版本的依赖版本
本包的每个版本把子依赖解析到了哪个版本。版本发生变动的子依赖排在最前:升级正是在那里改变了你脚下的东西。
| 库 | 7.3.0 | 4.3.2 |
|---|---|---|
| environment | 1.1.0 | — |
| type-fest | — | 0.21.3 |
发生变动:0 · 所有版本相同:2
一条边记录的是解析器在真实机器上把一个版本放在了另一个版本旁边。它并不主张两者能协同工作;那个问题由样本和契约回答,而不是由这里存在一行来回答。
近期失败聚类
-
已观测 UNKNOWN exit 1 ERR_ASSERTION 证据缺口 ×1 4.3.2 executionContext=node · moduleSystem=esm · os=linux · runtime=node@22.23 sha256:054c93088b95…node:internal/modules/run_main:<n> · triggerUncaughtException( · ^ …node · unclassified-diagnostic · outer node · gap stage-unknown证据质量: complete · 环境变体: 1 · 首次记录: 2026-08-31 · 最近观测: 2026-08-31诊断复验候选
-
已观测 UNKNOWN exit 1 证据缺口 ×1 4.3.2 executionContext=node · moduleSystem=cjs · os=linux · runtime=node@22.23 sha256:91ad26545eb1…node:internal/modules/cjs/loader:<n> · throw err; · ^ · Error: Cannot find module <str>node · unclassified-diagnostic · outer node · gap stage-unknown证据质量: complete · 环境变体: 1 · 首次记录: 2026-08-31 · 最近观测: 2026-08-31诊断复验候选
-
已观测 UNKNOWN exit 1 ERR_ASSERTION 证据缺口 ×1 4.3.2 executionContext=node · moduleSystem=cjs · os=linux · runtime=node@22.23 sha256:eb0938a47430…node:assert:<n> · throw new AssertionError(obj); · ^ · AssertionError [ERR_ASSERTION]: jest.getVersion() should return 29.6.3node · unclassified-diagnostic · outer node · gap stage-unknown证据质量: complete · 环境变体: 1 · 首次记录: 2026-08-31 · 最近观测: 2026-08-31诊断复验候选
-
已观测 UNKNOWN exit 1 ERR_ASSERTION 证据缺口 ×1 4.3.2 executionContext=node · moduleSystem=cjs · os=linux · runtime=node@22.23 sha256:769e5b509341…node:internal/process/promises:<n> · triggerUncaughtException(err, true <path> fromPromise */); · ^ …node · unclassified-diagnostic · outer node · gap stage-unknown证据质量: complete · 环境变体: 1 · 首次记录: 2026-08-31 · 最近观测: 2026-08-31诊断复验候选
-
已观测 UNKNOWN exit 1 ERR_ASSERTION 证据缺口 ×1 4.3.2 executionContext=node · moduleSystem=cjs · os=linux · runtime=node@22.23 sha256:a878372dcfe9…AssertionError [ERR_ASSERTION]: getVersion must return 30.4.2 · <str> !== <str> · at main (<path>:<n>:<n>) · at Object.<anonymous> (<path>:<n>:<n>)node · unclassified-diagnostic · outer node · gap stage-unknown证据质量: complete · 环境变体: 1 · 首次记录: 2026-08-31 · 最近观测: 2026-08-31诊断复验候选
-
已观测 UNKNOWN exit 13 证据缺口 ×1 4.3.2 executionContext=node · moduleSystem=esm · os=linux · runtime=node@22.23 sha256:4a939d00eec4…Warning: Detected unsettled top-level await at <url>]:<n> · const ans = await promptPromise; · ^ · fil<path>:<n>node · unclassified-diagnostic · outer node · gap stage-unknown证据质量: complete · 环境变体: 1 · 首次记录: 2026-09-16 · 最近观测: 2026-09-16诊断复验候选
-
已观测 UNKNOWN exit 1 ERR_ASSERTION 证据缺口 ×1 4.3.2 executionContext=node · moduleSystem=cjs · os=linux · runtime=node@22.23 sha256:b12460008ca6…Test failed: AssertionError [ERR_ASSERTION]: Expected values to be strictly equal: · true !== false · at runTests (<url>) · at <url>node · unclassified-diagnostic · outer node · gap stage-unknown证据质量: complete · 环境变体: 1 · 首次记录: 2026-09-16 · 最近观测: 2026-09-16诊断复验候选
-
已观测 UNKNOWN exit 1 证据缺口 ×1 4.3.2 executionContext=node · moduleSystem=cjs · os=linux · runtime=node@22.23 sha256:c0573fd829b8…<url> · import confirm, { promptConfirm } from <str>; · ^^^^^^^ · SyntaxError: The requested module <str> does not provide an export named <str>node · unclassified-diagnostic · outer node · gap stage-unknown证据质量: complete · 环境变体: 1 · 首次记录: 2026-09-16 · 最近观测: 2026-09-16诊断复验候选
-
已观测 UNKNOWN exit 1 ERR_ASSERTION 证据缺口 ×1 4.3.2 executionContext=node · moduleSystem=cjs · os=linux · runtime=node@22.23 sha256:deb29d18a641…Test failed: AssertionError [ERR_ASSERTION]: Expected values to be strictly equal: · + actual - expected · + <str> · - <str>node · unclassified-diagnostic · outer node · gap stage-unknown证据质量: complete · 环境变体: 1 · 首次记录: 2026-09-16 · 最近观测: 2026-09-16诊断复验候选
-
已观测 UNKNOWN exit 1 ERR_ASSERTION 证据缺口 ×1 4.3.2 executionContext=node · moduleSystem=esm · os=linux · runtime=node@22.23 sha256:eff444dbb236…Contract test failure: AssertionError [ERR_ASSERTION]: Plain object should not be identified as Separator · true !== false · at testSeparator (<url>) …node · unclassified-diagnostic · outer node · gap stage-unknown证据质量: complete · 环境变体: 1 · 首次记录: 2026-09-16 · 最近观测: 2026-09-16诊断复验候选