기록npmagent-base7.1.4
조건 변경
현재 조건
agent-base @7.1.4ubuntu glibc · x64 · node 22 · npm 10 · node
API가 아니라 패키지 전체 집계
31회 중 0회 통과
검증 — 이 네트워크가 이 좌표에서 컨트랙트를 직접 실행했습니다.
샘플 있음 — 이 좌표에서 우리가 실행했고 실패함 (1)
- 프로젝트 관측
- 142 / 151
- 컨트랙트 검증
- 0 / 31
- 사용 기록
- 91
- 독립 보고 peer
- 1
- fingerprint가 수집된 실패
- 6 / 9
- 마지막 기록
- 2026-10-21
열어 볼 수 있는 증거
의존성 건강도
어떤 해결 과정이 이 릴리스의 트리를 읽었고 의존성이 없었습니다. 빠진 것이 아니라 측정된 것입니다.
최근 실패 클러스터
-
관측됨 PROJECT_PROCESS ERR_ASSERTION 증거 공백 ×8 6.0.2 → 7.1.4 executionContext=node증거 품질: legacy-evidence-incomplete · 환경 변형: 3 · 최초 관측: 2026-08-18 · 마지막 관측: 2026-08-27진단 재검증 후보
-
관측됨 PROCESS_START process start failed 증거 공백 ×7 6.0.2 → 7.1.4 executionContext=node sha256:c12549970456…· structured-termination · gap diagnostic-missing증거 품질: partial · 환경 변형: 2 · 최초 관측: 2026-08-29 · 마지막 관측: 2026-09-16진단 재검증 후보
-
관측됨 UNKNOWN exit 1 ERR_ASSERTION 증거 공백 ×7 6.0.2 → 7.1.4 → 9.0.0 executionContext=node · os=linux · runtime=node@22.23 sha256:986d98189e70…node:internal/modules/run_main:<n> · triggerUncaughtException( · ^ · AssertionError [ERR_ASSERTION]: Expected values to be strictly equal:node · unclassified-diagnostic · outer node · gap stage-unknown증거 품질: complete · 환경 변형: 2 · 최초 관측: 2026-08-29 · 마지막 관측: 2026-10-20진단 재검증 후보
-
관측됨 UNKNOWN exit 1 증거 공백 ×6 7.1.4 executionContext=node · moduleSystem=cjs sha256:bc4d7ddc5bcd…node:internal/modules/cjs/loader:<n> · throw err; · ^ · Error: Cannot find module <str>npm · unclassified-diagnostic · outer npm run, npm test · gap stage-unknown증거 품질: complete · 환경 변형: 2 · 최초 관측: 2026-09-02 · 마지막 관측: 2026-09-14진단 재검증 후보
-
관측됨 UNKNOWN exit 1 증거 공백 ×3 6.0.2 → 7.1.4 executionContext=node · moduleSystem=cjs · os=linux · runtime=node@22.23 sha256:91ad26545eb1…node:internal/modules/cjs/loader:<n> · throw err; · ^ · Error: Cannot find module <str>node · unclassified-diagnostic · outer node · gap stage-unknown증거 품질: complete · 환경 변형: 1 · 최초 관측: 2026-08-29 · 마지막 관측: 2026-08-31진단 재검증 후보
-
관측됨 UNKNOWN exit 1 ERR_ASSERTION 증거 공백 ×3 7.1.4 executionContext=node · os=linux · runtime=node@22.23 sha256:43caf7a060e7…node:internal/modules/run_main:<n> · triggerUncaughtException( · ^ · AssertionError [ERR_ASSERTION]: Expected values to be strictly deep-equal:node · unclassified-diagnostic · outer node · gap stage-unknown증거 품질: complete · 환경 변형: 2 · 최초 관측: 2026-10-21 · 마지막 관측: 2026-10-21진단 재검증 후보
-
관측됨 UNKNOWN exit 1 증거 공백 ×2 7.1.4 executionContext=node · moduleSystem=esm · os=linux · runtime=node@22.23 sha256:536db39a2e08…<path>:<n> · const closeError = new Error(<str>) · ^ · Error: command failednpm · unclassified-diagnostic · outer npm test · gap stage-unknown증거 품질: complete · 환경 변형: 1 · 최초 관측: 2026-10-18 · 마지막 관측: 2026-10-18진단 재검증 후보
-
관측됨 PROJECT_TEST exit 1 ERR_ASSERTION ×2 7.1.4 executionContext=node · moduleSystem=esm · os=linux · runtime=node@22.23 sha256:4904e63e5296…AssertionError [ERR_ASSERTION]: Expected values to be strictly equal: · + actual - expected · + <str> · - <str>javascript/test-runner · test-runner-diagnostic · outer npm test증거 품질: complete · 환경 변형: 1 · 최초 관측: 2026-10-18 · 마지막 관측: 2026-10-20
-
관측됨 UNKNOWN exit 1 증거 공백 ×1 7.1.4 executionContext=node · moduleSystem=cjs · os=linux · runtime=node@22.23 sha256:0c06875294a4…Contract test failed: TypeError: Cannot read properties of undefined (reading <str>) · at runContract (<url>) …node · unclassified-diagnostic · outer node · gap stage-unknown증거 품질: complete · 환경 변형: 1 · 최초 관측: 2026-08-30 · 마지막 관측: 2026-08-30진단 재검증 후보
-
관측됨 UNKNOWN exit 1 ERR_ASSERTION 증거 공백 ×1 7.1.4 executionContext=node · moduleSystem=cjs · os=linux · runtime=node@22.23 sha256:0d62cac8c07a…AssertionError [ERR_ASSERTION]: Expected values to be strictly equal: · + actual - expected · + <str> · - <str>node · unclassified-diagnostic · outer node · gap stage-unknown증거 품질: complete · 환경 변형: 1 · 최초 관측: 2026-08-30 · 마지막 관측: 2026-08-30진단 재검증 후보
-
관측됨 UNKNOWN exit 1 증거 공백 ×1 7.1.4 executionContext=node · moduleSystem=cjs · os=linux · runtime=node@22.23 sha256:9630b514e713…Contract test failed: TypeError: this.terminate is not a function · at ProgressBar.set currentAmount [as currentAmount] <path>:<n>:<n>) …node · unclassified-diagnostic · outer node · gap stage-unknown증거 품질: complete · 환경 변형: 1 · 최초 관측: 2026-08-30 · 마지막 관측: 2026-08-30진단 재검증 후보
-
관측됨 UNKNOWN exit 1 ERR_ASSERTION 증거 공백 ×1 7.1.4 executionContext=node · moduleSystem=cjs · os=linux · runtime=node@22.23 sha256:9ed50b51742b…Contract test failed: AssertionError [ERR_ASSERTION]: Expected values to be strictly equal: · 0 !== 50 · at runContract (<url>) …node · unclassified-diagnostic · outer node · gap stage-unknown증거 품질: complete · 환경 변형: 1 · 최초 관측: 2026-08-30 · 마지막 관측: 2026-08-30진단 재검증 후보
가장 많이 보고된 12개를 보여줍니다. 이 좌표에 기록된 실패 클러스터는 32개입니다. 나머지는 단발 보고입니다.