Registrosnpmagent-base7.1.4
Mudar as condições
Condições atuais
agent-base @7.1.4windows 11 · x64 · node 24 · pnpm 10 · node
total do pacote, não uma API
0 de 229 passaram
Verificado — esta rede executou um contrato nesta coordenada.
há uma amostra aqui e nossa execução nesta coordenada falhou (1)
- Observações de projetos
- 294 / 390
- Verificações de contrato
- 0 / 229
- Registros de uso
- 1.254
- Peers independentes que reportaram
- 1
- Falhas com impressão digital capturada
- 95 / 96
- Último registro
- 2026-09-26
Evidências que você pode abrir
Saúde das dependências
Uma resolução leu a árvore desta versão e não encontrou dependências. Isso é uma medição, não uma medição ausente.
Clusters de falha recentes
-
observado UNKNOWN exit 1 ERR_PNPM_RECURSIVE_RUN_FIRST_FAIL Lacuna de evidência ×32 7.1.4 executionContext=node · moduleSystem=esm · os=windows · runtime=node@24.13 sha256:9f91c9753081…(node:<n>) ExperimentalWarning: SQLite is an experimental feature and might change at any time …pnpm · unclassified-diagnostic · outer pnpm · gap stage-unknownQualidade da evidência: complete · Variantes de ambiente: 1 · Primeiro registro: 2026-09-01 · Visto por último: 2026-09-17Candidato a reverificação diagnóstica
-
observado UNKNOWN exit 1 ERR_PNPM_RECURSIVE_EXEC_FIRST_FAIL Lacuna de evidência ×28 7.1.4 executionContext=node · moduleSystem=esm · os=windows · runtime=node@24.13 sha256:979755e6489d…(node:<n>) ExperimentalWarning: SQLite is an experimental feature and might change at any time …pnpm · unclassified-diagnostic · outer pnpm · gap stage-unknownQualidade da evidência: complete · Variantes de ambiente: 1 · Primeiro registro: 2026-09-01 · Visto por último: 2026-09-14Candidato a reverificação diagnóstica
-
observado UNKNOWN exit 1 ERR_PNPM_RECURSIVE_EXEC_FIRST_FAIL Lacuna de evidência ×11 7.1.4 executionContext=node · moduleSystem=esm · os=windows · runtime=node@24.13 sha256:73873d2c4aed…<str> is not recognized as an internal or external command, · operable program or batch file. · undefined …pnpm · unclassified-diagnostic · outer pnpm · gap stage-unknownQualidade da evidência: complete · Variantes de ambiente: 1 · Primeiro registro: 2026-09-01 · Visto por último: 2026-09-01Candidato a reverificação diagnóstica
-
observado PROJECT_TEST exit 1 ELIFECYCLE ×10 7.1.4 executionContext=node · moduleSystem=esm · os=windows · runtime=node@24.13 sha256:7711694d48fa…ELIFECYCLE Test failed. See above for more details.javascript/test-runner · test-runner-diagnostic · outer pnpm testQualidade da evidência: complete · Variantes de ambiente: 1 · Primeiro registro: 2026-08-29 · Visto por último: 2026-09-01
-
observado PROJECT_TEST ENOENT Lacuna de evidência ×9 6.0.2 → 7.1.4 executionContext=node · os=windowsQualidade da evidência: legacy-evidence-incomplete · Variantes de ambiente: 4 · Primeiro registro: 2026-08-17 · Visto por último: 2026-08-25Candidato a reverificação diagnóstica
-
observado PROJECT_PROCESS ERR_ASSERTION Lacuna de evidência ×8 6.0.2 → 7.1.4 executionContext=nodeQualidade da evidência: legacy-evidence-incomplete · Variantes de ambiente: 3 · Primeiro registro: 2026-08-18 · Visto por último: 2026-08-27Candidato a reverificação diagnóstica
-
observado PROJECT_COMPILE exit 2 TS2307 ×8 6.0.2 → 7.1.4 executionContext=node · moduleSystem=cjs · os=windows · runtime=node@24.13 sha256:0470f88d95bb…lib/hooks/queries/index.ts(<n>,<n>): error TS2307: Cannot find module <str> or its corresponding type declarations. …typescript/tsc · compiler-diagnosticQualidade da evidência: complete · Variantes de ambiente: 1 · Primeiro registro: 2026-09-01 · Visto por último: 2026-09-01
-
observado PROJECT_COMPILE exit 2 TS7006 ×8 6.0.2 → 7.1.4 executionContext=node · moduleSystem=cjs · os=windows · runtime=node@24.13 sha256:21025cd78572…app/api/politicians/[id]/real-estates/route.ts(<n>,<n>): error TS7006: Parameter <str> implicitly has an <str> type. …typescript/tsc · compiler-diagnosticQualidade da evidência: complete · Variantes de ambiente: 1 · Primeiro registro: 2026-09-01 · Visto por último: 2026-09-01
-
observado PROJECT_COMPILE exit 2 TS2561 ×8 6.0.2 → 7.1.4 executionContext=node · moduleSystem=cjs · os=windows · runtime=node@24.13 sha256:5f96e966539e…app/api/politicians/[id]/real-estates/route.ts(<n>,<n>): error TS2561: Object literal may only specify known properties, but <str> does not exist in type …typescript/tsc · compiler-diagnosticQualidade da evidência: complete · Variantes de ambiente: 1 · Primeiro registro: 2026-09-01 · Visto por último: 2026-09-01
-
observado PROJECT_COMPILE exit 2 TS2345 ×8 6.0.2 → 7.1.4 executionContext=node · moduleSystem=cjs · os=windows · runtime=node@24.13 sha256:7e077f646acc…lib/api/real-estate-statistics.ts(<n>,<n>): error TS2345: Argument of type <str> is not assignable to parameter of type <str>.typescript/tsc · compiler-diagnosticQualidade da evidência: complete · Variantes de ambiente: 1 · Primeiro registro: 2026-09-01 · Visto por último: 2026-09-01
-
observado PROJECT_COMPILE exit 2 TS2551 ×8 6.0.2 → 7.1.4 executionContext=node · moduleSystem=cjs · os=windows · runtime=node@24.13 sha256:8a1ebc675f2b…app/api/politicians/[id]/real-estates/route.ts(<n>,<n>): error TS2551: Property <str> does not exist on type <str>. Did you mean <str>? …typescript/tsc · compiler-diagnosticQualidade da evidência: complete · Variantes de ambiente: 1 · Primeiro registro: 2026-09-01 · Visto por último: 2026-09-01
-
observado PROJECT_COMPILE exit 2 TS2339 ×8 6.0.2 → 7.1.4 executionContext=node · moduleSystem=cjs · os=windows · runtime=node@24.13 sha256:e51205820175…lib/api/real-estate-map-addresses.ts(<n>,<n>): error TS2339: Property <str> does not exist on type <str>.typescript/tsc · compiler-diagnosticQualidade da evidência: complete · Variantes de ambiente: 1 · Primeiro registro: 2026-09-01 · Visto por último: 2026-09-01
Mostrando os 12 mais relatados de 310 grupos de falhas registrados. O resto são relatos únicos.