기록npmagent-base7.1.4
조건 변경
현재 조건
agent-base @7.1.4windows 11 · x64 · node 24 · pnpm 10 · node
API가 아니라 패키지 전체 집계
229회 중 0회 통과
검증 — 이 네트워크가 이 좌표에서 컨트랙트를 직접 실행했습니다.
샘플 있음 — 이 좌표에서 우리가 실행했고 실패함 (1)
- 프로젝트 관측
- 294 / 390
- 컨트랙트 검증
- 0 / 229
- 사용 기록
- 1,254
- 독립 보고 peer
- 1
- fingerprint가 수집된 실패
- 95 / 96
- 마지막 기록
- 2026-09-26
열어 볼 수 있는 증거
의존성 건강도
어떤 해결 과정이 이 릴리스의 트리를 읽었고 의존성이 없었습니다. 빠진 것이 아니라 측정된 것입니다.
최근 실패 클러스터
-
관측됨 UNKNOWN exit 1 ERR_PNPM_RECURSIVE_RUN_FIRST_FAIL 증거 공백 ×32 7.1.4 executionContext=node · moduleSystem=esm · os=windows · runtime=node@24.13 sha256:9f91c9753081…(node:<n>) ExperimentalWarning: SQLite is an experimental feature and might change at any time …pnpm · unclassified-diagnostic · outer pnpm · gap stage-unknown증거 품질: complete · 환경 변형: 1 · 최초 관측: 2026-09-01 · 마지막 관측: 2026-09-17진단 재검증 후보
-
관측됨 UNKNOWN exit 1 ERR_PNPM_RECURSIVE_EXEC_FIRST_FAIL 증거 공백 ×28 7.1.4 executionContext=node · moduleSystem=esm · os=windows · runtime=node@24.13 sha256:979755e6489d…(node:<n>) ExperimentalWarning: SQLite is an experimental feature and might change at any time …pnpm · unclassified-diagnostic · outer pnpm · gap stage-unknown증거 품질: complete · 환경 변형: 1 · 최초 관측: 2026-09-01 · 마지막 관측: 2026-09-14진단 재검증 후보
-
관측됨 UNKNOWN exit 1 ERR_PNPM_RECURSIVE_EXEC_FIRST_FAIL 증거 공백 ×11 7.1.4 executionContext=node · moduleSystem=esm · os=windows · runtime=node@24.13 sha256:73873d2c4aed…<str> is not recognized as an internal or external command, · operable program or batch file. · undefined …pnpm · unclassified-diagnostic · outer pnpm · gap stage-unknown증거 품질: complete · 환경 변형: 1 · 최초 관측: 2026-09-01 · 마지막 관측: 2026-09-01진단 재검증 후보
-
관측됨 PROJECT_TEST exit 1 ELIFECYCLE ×10 7.1.4 executionContext=node · moduleSystem=esm · os=windows · runtime=node@24.13 sha256:7711694d48fa…ELIFECYCLE Test failed. See above for more details.javascript/test-runner · test-runner-diagnostic · outer pnpm test증거 품질: complete · 환경 변형: 1 · 최초 관측: 2026-08-29 · 마지막 관측: 2026-09-01
-
관측됨 PROJECT_TEST ENOENT 증거 공백 ×9 6.0.2 → 7.1.4 executionContext=node · os=windows증거 품질: legacy-evidence-incomplete · 환경 변형: 4 · 최초 관측: 2026-08-17 · 마지막 관측: 2026-08-25진단 재검증 후보
-
관측됨 PROJECT_PROCESS ECONNREFUSED 증거 공백 ×8 6.0.2 → 7.1.4 executionContext=node증거 품질: legacy-evidence-incomplete · 환경 변형: 3 · 최초 관측: 2026-08-18 · 마지막 관측: 2026-08-27진단 재검증 후보
-
관측됨 PROJECT_COMPILE exit 2 TS2307 ×8 6.0.2 → 7.1.4 executionContext=node · moduleSystem=cjs · os=windows · runtime=node@24.13 sha256:0470f88d95bb…lib/hooks/queries/index.ts(<n>,<n>): error TS2307: Cannot find module <str> or its corresponding type declarations. …typescript/tsc · compiler-diagnostic증거 품질: complete · 환경 변형: 1 · 최초 관측: 2026-09-01 · 마지막 관측: 2026-09-01
-
관측됨 PROJECT_COMPILE exit 2 TS7006 ×8 6.0.2 → 7.1.4 executionContext=node · moduleSystem=cjs · os=windows · runtime=node@24.13 sha256:21025cd78572…app/api/politicians/[id]/real-estates/route.ts(<n>,<n>): error TS7006: Parameter <str> implicitly has an <str> type. …typescript/tsc · compiler-diagnostic증거 품질: complete · 환경 변형: 1 · 최초 관측: 2026-09-01 · 마지막 관측: 2026-09-01
-
관측됨 PROJECT_COMPILE exit 2 TS2561 ×8 6.0.2 → 7.1.4 executionContext=node · moduleSystem=cjs · os=windows · runtime=node@24.13 sha256:5f96e966539e…app/api/politicians/[id]/real-estates/route.ts(<n>,<n>): error TS2561: Object literal may only specify known properties, but <str> does not exist in type …typescript/tsc · compiler-diagnostic증거 품질: complete · 환경 변형: 1 · 최초 관측: 2026-09-01 · 마지막 관측: 2026-09-01
-
관측됨 PROJECT_COMPILE exit 2 TS2345 ×8 6.0.2 → 7.1.4 executionContext=node · moduleSystem=cjs · os=windows · runtime=node@24.13 sha256:7e077f646acc…lib/api/real-estate-statistics.ts(<n>,<n>): error TS2345: Argument of type <str> is not assignable to parameter of type <str>.typescript/tsc · compiler-diagnostic증거 품질: complete · 환경 변형: 1 · 최초 관측: 2026-09-01 · 마지막 관측: 2026-09-01
-
관측됨 PROJECT_COMPILE exit 2 TS2551 ×8 6.0.2 → 7.1.4 executionContext=node · moduleSystem=cjs · os=windows · runtime=node@24.13 sha256:8a1ebc675f2b…app/api/politicians/[id]/real-estates/route.ts(<n>,<n>): error TS2551: Property <str> does not exist on type <str>. Did you mean <str>? …typescript/tsc · compiler-diagnostic증거 품질: complete · 환경 변형: 1 · 최초 관측: 2026-09-01 · 마지막 관측: 2026-09-01
-
관측됨 PROJECT_COMPILE exit 2 TS2339 ×8 6.0.2 → 7.1.4 executionContext=node · moduleSystem=cjs · os=windows · runtime=node@24.13 sha256:e51205820175…lib/api/real-estate-map-addresses.ts(<n>,<n>): error TS2339: Property <str> does not exist on type <str>.typescript/tsc · compiler-diagnostic증거 품질: complete · 환경 변형: 1 · 최초 관측: 2026-09-01 · 마지막 관측: 2026-09-01
가장 많이 보고된 12개를 보여줍니다. 이 좌표에 기록된 실패 클러스터는 310개입니다. 나머지는 단발 보고입니다.