Relevésnpmagent-base7.1.4
Changer les conditions
Conditions actuelles
agent-base @7.1.4alpine musl · x64 · node 22 · npm · node
total du paquet, pas une API
1 sur 1 ont réussi
Vérifié — ce réseau a exécuté un contrat à cette coordonnée.
il y a un échantillon ici et notre exécution à cette coordonnée s'est terminée proprement (1)
- Observations de projets
- 2 / 2
- Vérifications de contrat
- 1 / 1
- Enregistrements d'usage
- 1
- Pairs rapporteurs indépendants
- 1
- Dernier enregistrement
- 2026-08-30
Preuves que vous pouvez ouvrir
Santé des dépendances
Une résolution a lu l'arbre de cette version et n'a trouvé aucune dépendance. C'est une mesure, pas une mesure manquante.
Clusters d'échecs récents
-
observé PROJECT_PROCESS ERR_ASSERTION Lacune de preuve ×8 6.0.2 → 7.1.4 executionContext=nodeQualité de preuve: legacy-evidence-incomplete · Variantes d’environnement: 3 · Premier relevé: 2026-08-18 · Dernière observation: 2026-08-27Candidat à une revérification diagnostique
-
observé PROCESS_START process start failed Lacune de preuve ×7 6.0.2 → 7.1.4 executionContext=node sha256:c12549970456…· structured-termination · gap diagnostic-missingQualité de preuve: partial · Variantes d’environnement: 2 · Premier relevé: 2026-08-29 · Dernière observation: 2026-09-16Candidat à une revérification diagnostique
-
observé UNKNOWN exit 1 ERR_ASSERTION Lacune de preuve ×6 6.0.2 → 7.1.4 → 9.0.0 executionContext=node · os=linux · runtime=node@22.23 sha256:986d98189e70…node:internal/modules/run_main:<n> · triggerUncaughtException( · ^ · AssertionError [ERR_ASSERTION]: Expected values to be strictly equal:node · unclassified-diagnostic · outer node · gap stage-unknownQualité de preuve: complete · Variantes d’environnement: 2 · Premier relevé: 2026-08-29 · Dernière observation: 2026-09-14Candidat à une revérification diagnostique
-
observé UNKNOWN exit 1 Lacune de preuve ×6 7.1.4 executionContext=node · moduleSystem=cjs sha256:bc4d7ddc5bcd…node:internal/modules/cjs/loader:<n> · throw err; · ^ · Error: Cannot find module <str>npm · unclassified-diagnostic · outer npm run, npm test · gap stage-unknownQualité de preuve: complete · Variantes d’environnement: 2 · Premier relevé: 2026-09-02 · Dernière observation: 2026-09-14Candidat à une revérification diagnostique
-
observé UNKNOWN exit 1 Lacune de preuve ×3 6.0.2 → 7.1.4 executionContext=node · moduleSystem=cjs · os=linux · runtime=node@22.23 sha256:91ad26545eb1…node:internal/modules/cjs/loader:<n> · throw err; · ^ · Error: Cannot find module <str>node · unclassified-diagnostic · outer node · gap stage-unknownQualité de preuve: complete · Variantes d’environnement: 1 · Premier relevé: 2026-08-29 · Dernière observation: 2026-08-31Candidat à une revérification diagnostique
-
observé UNKNOWN exit 1 Lacune de preuve ×2 7.1.4 executionContext=node · moduleSystem=esm · os=linux · runtime=node@22.23 sha256:536db39a2e08…<path>:<n> · const closeError = new Error(<str>) · ^ · Error: command failednpm · unclassified-diagnostic · outer npm test · gap stage-unknownQualité de preuve: complete · Variantes d’environnement: 1 · Premier relevé: 2026-10-18 · Dernière observation: 2026-10-18Candidat à une revérification diagnostique
-
observé UNKNOWN exit 1 Lacune de preuve ×1 7.1.4 executionContext=node · moduleSystem=cjs · os=linux · runtime=node@22.23 sha256:0c06875294a4…Contract test failed: TypeError: Cannot read properties of undefined (reading <str>) · at runContract (<url>) …node · unclassified-diagnostic · outer node · gap stage-unknownQualité de preuve: complete · Variantes d’environnement: 1 · Premier relevé: 2026-08-30 · Dernière observation: 2026-08-30Candidat à une revérification diagnostique
-
observé UNKNOWN exit 1 ERR_ASSERTION Lacune de preuve ×1 7.1.4 executionContext=node · moduleSystem=cjs · os=linux · runtime=node@22.23 sha256:0d62cac8c07a…AssertionError [ERR_ASSERTION]: Expected values to be strictly equal: · + actual - expected · + <str> · - <str>node · unclassified-diagnostic · outer node · gap stage-unknownQualité de preuve: complete · Variantes d’environnement: 1 · Premier relevé: 2026-08-30 · Dernière observation: 2026-08-30Candidat à une revérification diagnostique
-
observé UNKNOWN exit 1 Lacune de preuve ×1 7.1.4 executionContext=node · moduleSystem=cjs · os=linux · runtime=node@22.23 sha256:9630b514e713…Contract test failed: TypeError: this.terminate is not a function · at ProgressBar.set currentAmount [as currentAmount] <path>:<n>:<n>) …node · unclassified-diagnostic · outer node · gap stage-unknownQualité de preuve: complete · Variantes d’environnement: 1 · Premier relevé: 2026-08-30 · Dernière observation: 2026-08-30Candidat à une revérification diagnostique
-
observé UNKNOWN exit 1 ERR_ASSERTION Lacune de preuve ×1 7.1.4 executionContext=node · moduleSystem=cjs · os=linux · runtime=node@22.23 sha256:9ed50b51742b…Contract test failed: AssertionError [ERR_ASSERTION]: Expected values to be strictly equal: · 0 !== 50 · at runContract (<url>) …node · unclassified-diagnostic · outer node · gap stage-unknownQualité de preuve: complete · Variantes d’environnement: 1 · Premier relevé: 2026-08-30 · Dernière observation: 2026-08-30Candidat à une revérification diagnostique
-
observé UNKNOWN exit 1 Lacune de preuve ×1 7.1.4 executionContext=node · moduleSystem=cjs · os=linux · runtime=node@22.23 sha256:a592ca8c2930…Contract test failed: TypeError: this.stream.moveCursor is not a function · at MultiProgress.allocateLines <path>:<n>:<n>) …node · unclassified-diagnostic · outer node · gap stage-unknownQualité de preuve: complete · Variantes d’environnement: 1 · Premier relevé: 2026-08-30 · Dernière observation: 2026-08-30Candidat à une revérification diagnostique
-
observé UNKNOWN exit 1 Lacune de preuve ×1 7.1.4 executionContext=node · moduleSystem=cjs · os=linux · runtime=node@22.23 sha256:e1d65fc7c136…<path>:<n> · throw new Error(`Unsupported arch ${name}`) · ^ · Error: Unsupported arch 1node · unclassified-diagnostic · outer node · gap stage-unknownQualité de preuve: complete · Variantes d’environnement: 1 · Premier relevé: 2026-08-30 · Dernière observation: 2026-08-30Candidat à une revérification diagnostique
Affichage des 12 plus signalés parmi 26 groupes d’échecs enregistrés. Le reste sont des signalements uniques.