기록npm@vitest/utils2.1.9
조건 변경
현재 조건
@vitest/utils @2.1.9ubuntu glibc · x64 · node 22 · npm 10 · node
API가 아니라 패키지 전체 집계
21회 중 0회 통과
검증 — 이 네트워크가 이 좌표에서 컨트랙트를 직접 실행했습니다.
샘플 있음 — 이 좌표에서 우리가 실행했고 실패함 (1)
- 프로젝트 관측
- 84 / 84
- 컨트랙트 검증
- 0 / 21
- 사용 기록
- 54
- 독립 보고 peer
- 3
- 마지막 기록
- 2026-09-06
열어 볼 수 있는 증거
의존성 건강도
이 릴리스의 의존성 조합과 실패 관측 결과
관측된 문제 1건 ·
변경 2건 ·
정상 1건
| 라이브러리 | 버전 | 건강도 | 그 좌표에서 측정된 것 | 프로젝트 |
|---|---|---|---|---|
| @vitest/pretty-format | 2.1.9 | CANDIDATE 상관 변경; 조합 결과 미증명 | 컨트랙트 통과 | 프로젝트-일 45개 |
| tinyrainbow | 1.2.0 | CANDIDATE 상관 변경; 조합 결과 미증명 | 컨트랙트 통과 | 프로젝트-일 45개 |
| loupe | 3.2.1 | PASS 모든 관측 정상 통과 | 컨트랙트 통과 | 프로젝트-일 43개 |
측정 열은 각 의존성 자신의 릴리스에 대한 것이지 두 릴리스의 조합에 대한 것이 아닙니다. 리졸버가 둘을 나란히 놓았다는 사실은 함께 동작한다는 증거가 아닙니다.
릴리스별 의존성 버전
이 패키지의 릴리스마다 자식이 어떤 버전으로 해석됐는지입니다. 버전이 움직인 자식이 먼저 나옵니다 — 업그레이드가 발밑에서 무언가를 바꾼 지점입니다.
| 라이브러리 | 4.1.11 | 4.1.10 | 4.0.18 | 4.0.16 | 4.0.0 | 3.2.7 | 3.2.4 | 3.0.0 | 2.1.9 |
|---|---|---|---|---|---|---|---|---|---|
| @vitest/pretty-format | 4.1.11 | 4.1.10 | 4.0.18 | 4.0.16 | 4.0.0 | 3.2.7 | 3.2.4 | 3.0.0 | 2.1.9 |
| tinyrainbow | 3.1.1 | 3.1.1 | 3.1.1 | 3.0.3 | 3.1.1 | 2.0.0 | 2.0.0 | 2.0.0 | 1.2.0 |
| convert-source-map | 2.0.0 | 2.0.0 | — | — | — | — | — | — | — |
| loupe | — | — | — | — | — | 3.2.1 | 3.2.1 | 3.2.1 | 3.2.1 |
움직임: 2 · 모든 릴리스에서 동일: 2
엣지는 실제 기계에서 리졸버가 한 릴리스를 다른 릴리스 옆에 놓았다는 기록입니다. 둘이 함께 동작한다는 주장이 아닙니다. 그 질문은 여기 행이 있다는 사실이 아니라 샘플과 컨트랙트가 답합니다.
최근 실패 클러스터
-
관측됨 PROCESS_START process start failed 증거 공백 ×10 2.1.9 → 3.0.0 → 3.2.4 → 3.2.7 executionContext=node sha256:c12549970456…· structured-termination · gap diagnostic-missing증거 품질: partial · 환경 변형: 3 · 최초 관측: 2026-08-31 · 마지막 관측: 2026-09-16진단 재검증 후보
-
관측됨 UNKNOWN exit 1 ERR_ASSERTION 증거 공백 ×6 2.1.9 → 4.1.10 → 4.1.11 executionContext=node · os=linux · runtime=node@22.23 sha256:986d98189e70…node:internal/modules/run_main:<n> · triggerUncaughtException( · ^ · AssertionError [ERR_ASSERTION]: Expected values to be strictly equal:node · unclassified-diagnostic · outer node · gap stage-unknown증거 품질: complete · 환경 변형: 2 · 최초 관측: 2026-09-06 · 마지막 관측: 2026-09-06진단 재검증 후보
-
관측됨 UNKNOWN exit 1 증거 공백 ×3 2.1.9 → 3.0.0 executionContext=node · moduleSystem=esm · os=linux · runtime=node@22.23 sha256:8fd30f2a6304…fil<path>:<n> · throw new Error(errorMsg); · ^ · Error: Vitest failed to access its internal state.node · unclassified-diagnostic · outer node · gap stage-unknown증거 품질: complete · 환경 변형: 1 · 최초 관측: 2026-08-31 · 마지막 관측: 2026-09-08진단 재검증 후보
-
관측됨 UNKNOWN exit 1 ERR_MODULE_NOT_FOUND 증거 공백 ×3 2.1.9 → 4.1.10 executionContext=node · os=linux · runtime=node@22.23 sha256:88af852f99a8…node:internal/modules/package_json_reader:<n> · throw new ERR_MODULE_NOT_FOUND(packageName, fileURLToPath(base), null); · ^ …node · unclassified-diagnostic · outer node · gap stage-unknown증거 품질: complete · 환경 변형: 2 · 최초 관측: 2026-09-04 · 마지막 관측: 2026-09-06진단 재검증 후보
-
관측됨 UNKNOWN exit 1 증거 공백 ×2 2.1.9 executionContext=node · moduleSystem=esm · os=linux · runtime=node@22.23 sha256:42623a56826f…fil<path>:<n> · Object.defineProperty(expect.not, expectAssertionName, { · ^ · TypeError: Object.defineProperty called on non-objectnode · unclassified-diagnostic · outer node · gap stage-unknown증거 품질: complete · 환경 변형: 1 · 최초 관측: 2026-09-03 · 마지막 관측: 2026-09-04진단 재검증 후보
-
관측됨 UNKNOWN exit 1 증거 공백 ×2 2.1.9 executionContext=node · moduleSystem=cjs · os=linux · runtime=node@22.23 sha256:3b3190f2cd44…doc: cannot find package <str> in any of: · ($GOROOT not set) · <path> (from $GOPATH)go · unclassified-diagnostic · outer go · gap stage-unknown증거 품질: complete · 환경 변형: 1 · 최초 관측: 2026-09-04 · 마지막 관측: 2026-09-04진단 재검증 후보
-
관측됨 UNKNOWN exit 1 증거 공백 ×2 2.1.9 executionContext=node · moduleSystem=cjs · os=linux · runtime=node@22.23 sha256:f0288eb0529f…Traceback (most recent call last): · File <str>, line 19, in <module> · AssertionError· unclassified-diagnostic · gap stage-unknown증거 품질: complete · 환경 변형: 1 · 최초 관측: 2026-09-04 · 마지막 관측: 2026-09-04진단 재검증 후보
-
관측됨 UNKNOWN exit 1 증거 공백 ×1 2.1.9 executionContext=node · moduleSystem=cjs · os=linux · runtime=node@22.23 sha256:72ba2d1e946f…<path>: No module named pippython3 · unclassified-diagnostic · outer python3 · gap stage-unknown증거 품질: complete · 환경 변형: 1 · 최초 관측: 2026-08-31 · 마지막 관측: 2026-08-31진단 재검증 후보
-
관측됨 UNKNOWN exit 1 증거 공백 ×1 2.1.9 executionContext=node · moduleSystem=cjs · os=linux · runtime=node@22.23 sha256:91ad26545eb1…node:internal/modules/cjs/loader:<n> · throw err; · ^ · Error: Cannot find module <str>node · unclassified-diagnostic · outer node · gap stage-unknown증거 품질: complete · 환경 변형: 1 · 최초 관측: 2026-08-31 · 마지막 관측: 2026-08-31진단 재검증 후보
-
관측됨 UNKNOWN exit 1 증거 공백 ×1 2.1.9 executionContext=node · moduleSystem=cjs · os=linux · runtime=node@22.23 sha256:d7f5d491441c…Traceback (most recent call last): · File <str>, line 71, in <module> · AssertionError: is_annotated must return True for Annotated· unclassified-diagnostic · gap stage-unknown증거 품질: complete · 환경 변형: 1 · 최초 관측: 2026-08-31 · 마지막 관측: 2026-08-31진단 재검증 후보
-
관측됨 UNKNOWN exit 1 증거 공백 ×1 2.1.9 executionContext=node · moduleSystem=esm · os=linux · runtime=node@22.23 sha256:67b21c7b2753…Contract test failed: TypeError: Cannot assign to read only property <str> of function 'class Assertion { · constructor(obj) { · this._obj = obj; · }node · unclassified-diagnostic · outer node · gap stage-unknown증거 품질: complete · 환경 변형: 1 · 최초 관측: 2026-09-03 · 마지막 관측: 2026-09-03진단 재검증 후보
-
관측됨 UNKNOWN exit 1 증거 공백 ×1 2.1.9 executionContext=node · moduleSystem=esm · os=linux · runtime=node@22.23 sha256:db4b73d5113b…Contract test failed: TypeError: utils.addProperty is not a function · at JestChaiExpect (fil<path>:<n>:<n>) · at Object.use (<url>) …node · unclassified-diagnostic · outer node · gap stage-unknown증거 품질: complete · 환경 변형: 1 · 최초 관측: 2026-09-03 · 마지막 관측: 2026-09-03진단 재검증 후보
가장 많이 보고된 12개를 보여줍니다. 이 좌표에 기록된 실패 클러스터는 17개입니다. 나머지는 단발 보고입니다.